{"text_format":"1","workbook":"xlsx","n_sheets":13,"sheets":["User Tips","Property Info","EWEMs","Units and Spaces","Observations","Photos","Units - Print Sheet","CommonArea - Print Sheet","Data","LoanPropdat","EWEMdat","Updates","SecurityKey"],"not_rendered":{"charts":0,"images":1,"macros":1,"external_links":0,"defined_names":18,"comments":4,"pivot_tables":0},"unopened":[],"bounds":{"document_bytes":16777216,"sheet_cells":100000,"rows_first":2000,"rows_last":500,"rows_between":2000,"halvings":0,"cell_chars":16384,"cell_head_chars":4096},"cells_cut":0,"cells_raw":0,"read":"whole","date_system":"1900"}

{"sheet":"User Tips","index":0,"n_rows":31,"n_cols":3,"rows_kept":31,"cut":false,"hidden":false,"merged":[]}
["Red Cells are warnings",null,"This is Form 4221 Version 1-7"]
["Orange cell is a Partial Measure warning",null,"Updated September, 2021"]
["Yellow Cells are required fields that are blank"]
["Gray Cells are calculated or pulled from database"]
["Green Cells are auto calculations"]
["Black Cells are not required"]
[]
[]
[]
["Warning Flags:","Tab:"]
["There is a Complex EWEM","Property Info"]
["Not enough units inspected","Property Info and Observations"]
["There may be a partial measure","Property Info"]
["Completed after inspection ERROR","Property Info"]
["Partial measure flag shows Orange","EWEMs"]
["Unusual Nameplate Specification","EWEMs"]
[]
[]
["Guidance for Comments:"]
["Describe what you observed:"]
["- Quantities"]
["- Types of equipment"]
[]
["Was anything out of the ordinary?"]
["- Could you not get access?"]
["- Was there a noncompliance?"]
[]
["Is there anything you would want to note for later?"]
["- The property may ask to see the inspection report"]
[]
["FOR MORE SPACE IN CELLS: You can adjust the row height manually."]

{"sheet":"Property Info","index":1,"n_rows":28,"n_cols":8,"rows_kept":28,"cut":false,"hidden":false,"merged":[[2,1,2,3],[27,2,27,5],[19,2,19,3],[21,2,21,3],[22,2,22,3],[20,2,20,3],[23,2,23,3],[24,2,24,3],[25,2,25,3]]}
[null,null,"Green Rewards Verification Inspection Form"]
[null,"INPUT: Property and Inspection Information"]
[null,"Instructions:  Enter the Fannie Mae Loan ID and Property Linkage ID. The Servicer must confirm that the EWEMs listed in this Inspection Form match what is shown in the Schedule 6 and/or any Schedule 6 amendments. The inspector may then enter the inspection information."]
[null,"When completed and reviewed, submit this form to green_inspections@fanniemae.com."]
[null,"PROJECT INFORMATION"]
[]
[null,"Enter the Fannie Mae Loan ID here ↓",null,"Property Name","Pine Barren Estates"]
[null,1717479422,null,"Street Address","349 Marlboro Drive"]
[null,null,null,"City","Stockton"]
[null,"Enter the Property Linkage ID here ↓",null,"State","CA"]
[null,32155,null,"Zip",92587]
[null,null,null,"Origination Date","2018-03-31"]
[null,"Servicer Confirmation of EWEMs ↓",null,"Original Expected EWEM Completion Date","2019-03-31"]
[null,"Yes Servicer has confirmed EWEMs match S6",null,"Servicer","Atlantic Tower Inc"]
[null,null,null,"HPB Consultant","Cycle Energy Partners"]
[null,{"$f":"IF(E7=\"\",\"\",IF(COUNTIF(EWEMs!U5:U24,\"complex\")>0,\"This inspection contains complex EWEMs\",\"Does not contain complex EWEMs\"))","v":"Does not contain complex EWEMs"},null,"Number of Units",140]
[null,{"$f":"IF(COUNTIF(EWEMs!V5:V24,\"maybe partial\")>0, \"There may be a partial measure\", \"\")","v":""}]
[null,"INSPECTION INFORMATION"]
[]
[null,"Name of Inspector",null,null,null,"Total EWEMs",{"$f":"20-COUNTBLANK(selectedEWEMs)","v":6}]
[null,"Inspection Company",null,null,null,"Noncompliant EWEMs",{"$f":"COUNTIF(EWEMs!P5:P24,\"No\")","v":0},{"$f":"IF(G21>0,\"This property contains a noncompliant EWEM\",\"\")","v":""}]
[null,"Date of Inspection",null,null,null,"Noncompliant EWEM %",{"$f":"IFERROR(G21/G20,\"-\")","v":0}]
[null,"Date when all EWEMs were Completed",{"$f":"IF(MAX(EWEMs!H5:H24)=0,\"\",MAX(EWEMs!H5:H24))","v":""},null,{"$f":"IF(C23>C22,\"Completed after inspection ERROR\",\"\")","v":""},"Minimum number of units to inspect:",{"$f":"ROUND(IF('Property Info'!E16<20,3,IF('Property Info'!E16>600,30,IF('Property Info'!E16<56,5,IF('Property Info'!E16<100,'Property Info'!E16*0.1,IF('Property Info'!E16<201,10,'Property Info'!E16*0.05))))),0)","v":10}]
[null,"Site Visit Contact Name",null,null,null,"Number of units inspected:",{"$f":"Observations!D5","v":0},{"$f":"IF(SUM(EWEMs!Y5:Y24)>0, \"One or more EWEMs has fewer than the minimum number of Apartment observations\", \"\")","v":"One or more EWEMs has fewer than the minimum number of Apartment observations"}]
[null,"Contact Phone Number"]
[null,"Contact Email Address"]
[]
[null,"General Inspection Comments"]

{"sheet":"EWEMs","index":2,"n_rows":24,"n_cols":25,"rows_kept":24,"cut":false,"hidden":false,"merged":[[1,8,1,10]]}
[null,null,"INPUT: EWEM Inspection Information",null,null,null,null,null,null,null,null,null,null,null,null,null,null,null,null,null,"basic/complex","maybe partial","EWEM list name","Weird namplate error","Not enough apartments tests"]
[null,null,"Instructions:  Fill out the nameplate specification if it is an aerator, showerhead, or toilet. Add any EWEM-level comments.",null,{"$f":"IF(SUM(X5:X24)>0,\"↓Unusual Nameplate Spec - Please Review\",\"\")","v":""},null,null,null,{"$f":"\"Total Units in Bldg: \"&'Property Info'!E16","v":"Total Units in Bldg: 140"}]
[]
["Number","EWEM Number","EWEM Name","EWEM Description","Nameplate Specification","EWEM Estimated Cost","EWEM ACTUAL Cost","EWEM ACTUAL Date Completed","Space Category","Estimated Quantity Installed","Number of units in which to install","Inspection Result Description","Total Tests","Noncompliant Tests","Noncompliance %","EWEM Compliant Per S6? *Preliminary"]
[1,2,"Upgrade common area lighting","Lighting - Interior - High Efficiency (LED), Common Area",null,580,null,null,"Common Areas",0,0,null,{"$f":"IF(C5<>\"\",COUNTIF(Observations!$D$7:$D$506,EWEMs!W5),\"\")","v":0},{"$f":"IF(C5<>\"\",COUNTIF(Observations!L$7:L$506,EWEMs!W5&\"noncompliant\"),\"\")","v":0},{"$f":"IF(C5<>\"\",N5/M5,\"\")","v":{"$error":"#DIV/0!"}},{"$f":"IF(C5<>\"\",IF(OR(C5=\"Install low-flow kitchen faucets\", C5=\"Install low-flow bath faucets\", C5=\"Install low-flow showerheads\", C5=\"Install low-flow fixtures\"), IF(O5<=0.5,\"Yes\",\"No\"),\nIF(C5=\"Upgrade in-unit lighting\",IF(O5<0.255,\"Yes\",\"No\"),\nIF(OR(C5=\"Install low-flush toilets\", C5=\"Upgrade exterior lighting\", C5=\"Upgrade common area lighting\", C5=\"Upgrade whole building lighting\",C5=\"Replace wall/window AC\", C5=\"Add window films\", C5=\"Install or replace solar screens\"), IF(O5<0.105,\"Yes\", \"No\"),\nIF(O5=0,\"Yes\",\"No\")))),\"\")","v":{"$error":"#DIV/0!"}},null,null,null,null,{"$f":"VLOOKUP(C5,Data!A:I,9,FALSE)","v":"BASIC"},{"$f":"IF(AND(OR(I5=\"Apartments and Common Areas\", I5=\"Apartments\"),K5<0.95*'Property Info'!$E$16),\"maybe partial\",\"\")","v":""},{"$f":"IF(C5=\"\",\"\",B5&\" - \"&C5&\" - \"&I5)","v":"2 - Upgrade common area lighting - Common Areas"},{"$f":"IF(NOT(OR(E5=\"\",E5=0.5,E5=0.8, E5=1,E5=1.1, E5=1.25, E5=1.5, E5=1.75, E5=2)),1,0)","v":0},{"$f":"IF(AND(ISNUMBER(SEARCH(\"apartment\",I5)), M5<'Property Info'!$G$23), 1, 0)","v":0}]
[2,3,"Upgrade in-unit lighting","Lighting - Interior - High Efficiency (LED), All Res. Units",null,23000,null,null,"Apartments",0,140,null,{"$f":"IF(C6<>\"\",COUNTIF(Observations!$D$7:$D$506,EWEMs!W6),\"\")","v":0},{"$f":"IF(C6<>\"\",COUNTIF(Observations!L$7:L$506,EWEMs!W6&\"noncompliant\"),\"\")","v":0},{"$error":"#DIV/0!"},{"$error":"#DIV/0!"},null,null,null,null,{"$f":"VLOOKUP(C6,Data!A:I,9,FALSE)","v":"BASIC"},{"$f":"IF(AND(OR(I6=\"Apartments and Common Areas\", I6=\"Apartments\"),K6<0.95*'Property Info'!$E$16),\"maybe partial\",\"\")","v":""},{"$f":"IF(C6=\"\",\"\",B6&\" - \"&C6&\" - \"&I6)","v":"3 - Upgrade in-unit lighting - Apartments"},{"$f":"IF(NOT(OR(E6=\"\",E6=0.5,E6=0.8, E6=1,E6=1.1, E6=1.25, E6=1.5, E6=1.75, E6=2)),1,0)","v":0},{"$f":"IF(AND(ISNUMBER(SEARCH(\"apartment\",I6)), M6<'Property Info'!$G$23), 1, 0)","v":1}]
[3,4,"Upgrade exterior lighting","Lighting - Exterior - High Efficiency (LED), Common Area",null,670,null,null,"Common Areas",0,0,null,{"$f":"IF(C7<>\"\",COUNTIF(Observations!$D$7:$D$506,EWEMs!W7),\"\")","v":0},{"$f":"IF(C7<>\"\",COUNTIF(Observations!L$7:L$506,EWEMs!W7&\"noncompliant\"),\"\")","v":0},{"$error":"#DIV/0!"},{"$error":"#DIV/0!"},null,null,null,null,{"$f":"VLOOKUP(C7,Data!A:I,9,FALSE)","v":"BASIC"},{"$f":"IF(AND(OR(I7=\"Apartments and Common Areas\", I7=\"Apartments\"),K7<0.95*'Property Info'!$E$16),\"maybe partial\",\"\")","v":""},"4 - Upgrade exterior lighting - Common Areas",0,{"$f":"IF(AND(ISNUMBER(SEARCH(\"apartment\",I7)), M7<'Property Info'!$G$23), 1, 0)","v":0}]
[4,9,"Upgrade exterior lighting","Lighting - Exterior - High Efficiency (LED), All Res. Units",null,2400,null,null,"Apartments",0,140,null,{"$f":"IF(C8<>\"\",COUNTIF(Observations!$D$7:$D$506,EWEMs!W8),\"\")","v":0},{"$f":"IF(C8<>\"\",COUNTIF(Observations!L$7:L$506,EWEMs!W8&\"noncompliant\"),\"\")","v":0},{"$error":"#DIV/0!"},{"$error":"#DIV/0!"},null,null,null,null,{"$f":"VLOOKUP(C8,Data!A:I,9,FALSE)","v":"BASIC"},{"$f":"IF(AND(OR(I8=\"Apartments and Common Areas\", I8=\"Apartments\"),K8<0.95*'Property Info'!$E$16),\"maybe partial\",\"\")","v":""},"9 - Upgrade exterior lighting - Apartments",0,{"$f":"IF(AND(ISNUMBER(SEARCH(\"apartment\",I8)), M8<'Property Info'!$G$23), 1, 0)","v":1}]
[5,10,"Install low-flow kitchen faucets","Water Fixture - Kitchen Aerators (1.0 gpm), All Res. Units",null,1400,null,null,"Apartments",0,140,null,{"$f":"IF(C9<>\"\",COUNTIF(Observations!$D$7:$D$506,EWEMs!W9),\"\")","v":0},{"$f":"IF(C9<>\"\",COUNTIF(Observations!L$7:L$506,EWEMs!W9&\"noncompliant\"),\"\")","v":0},{"$error":"#DIV/0!"},{"$error":"#DIV/0!"},null,null,null,null,{"$f":"VLOOKUP(C9,Data!A:I,9,FALSE)","v":"BASIC"},{"$f":"IF(AND(OR(I9=\"Apartments and Common Areas\", I9=\"Apartments\"),K9<0.95*'Property Info'!$E$16),\"maybe partial\",\"\")","v":""},"10 - Install low-flow kitchen faucets - Apartments",0,{"$f":"IF(AND(ISNUMBER(SEARCH(\"apartment\",I9)), M9<'Property Info'!$G$23), 1, 0)","v":1}]
[6,11,"Install low-flow bath faucets","Water Fixture - Bathroom Aerators (0.5 gpm), All Res. Units",null,3168,null,null,"Apartments",0,140,null,{"$f":"IF(C10<>\"\",COUNTIF(Observations!$D$7:$D$506,EWEMs!W10),\"\")","v":0},{"$f":"IF(C10<>\"\",COUNTIF(Observations!L$7:L$506,EWEMs!W10&\"noncompliant\"),\"\")","v":0},{"$error":"#DIV/0!"},{"$error":"#DIV/0!"},null,null,null,null,{"$f":"VLOOKUP(C10,Data!A:I,9,FALSE)","v":"BASIC"},{"$f":"IF(AND(OR(I10=\"Apartments and Common Areas\", I10=\"Apartments\"),K10<0.95*'Property Info'!$E$16),\"maybe partial\",\"\")","v":""},"11 - Install low-flow bath faucets - Apartments",0,{"$f":"IF(AND(ISNUMBER(SEARCH(\"apartment\",I10)), M10<'Property Info'!$G$23), 1, 0)","v":1}]
[7,{"$f":"IFERROR(INDEX(EWEMdat!D:D,SMALL(IF(ewem_bp_ids=SecurityKey!$C$2,ROW(ewem_bp_ids)-MIN(ROW(ewem_bp_ids))+1),EWEMs!$A11)),\"\")","v":""},{"$f":"IFERROR(INDEX(EWEMdat!F:F,SMALL(IF(ewem_bp_ids=SecurityKey!$C$2,ROW(ewem_bp_ids)-MIN(ROW(ewem_bp_ids))+1),EWEMs!$A11)),\"\")","v":""},{"$f":"IFERROR(INDEX(EWEMdat!G:G,SMALL(IF(ewem_bp_ids=SecurityKey!$C$2,ROW(ewem_bp_ids)-MIN(ROW(ewem_bp_ids))+1),EWEMs!$A11)),\"\")&IFERROR(\" - \"&U11,\"\")","v":""},null,{"$f":"IFERROR(INDEX(EWEMdat!K:K,SMALL(IF(ewem_bp_ids=SecurityKey!$C$2,ROW(ewem_bp_ids)-MIN(ROW(ewem_bp_ids))+1),EWEMs!$A11)),\"\")","v":""},null,null,{"$f":"IFERROR(INDEX(EWEMdat!H:H,SMALL(IF(ewem_bp_ids=SecurityKey!$C$2,ROW(ewem_bp_ids)-MIN(ROW(ewem_bp_ids))+1),EWEMs!$A11)),\"\")","v":""},{"$f":"IFERROR(INDEX(EWEMdat!I:I,SMALL(IF(ewem_bp_ids=SecurityKey!$C$2,ROW(ewem_bp_ids)-MIN(ROW(ewem_bp_ids))+1),EWEMs!$A11)),\"\")","v":""},{"$f":"IFERROR(INDEX(EWEMdat!J:J,SMALL(IF(ewem_bp_ids=SecurityKey!$C$2,ROW(ewem_bp_ids)-MIN(ROW(ewem_bp_ids))+1),EWEMs!$A11)),\"\")","v":""},null,{"$f":"IF(C11<>\"\",COUNTIF(Observations!$D$7:$D$506,EWEMs!W11),\"\")","v":""},{"$f":"IF(C11<>\"\",COUNTIF(Observations!L$7:L$506,EWEMs!W11&\"noncompliant\"),\"\")","v":""},"","",null,null,null,null,{"$f":"VLOOKUP(C11,Data!A:I,9,FALSE)","v":{"$error":"#N/A"}},{"$f":"IF(AND(OR(I11=\"Apartments and Common Areas\", I11=\"Apartments\"),K11<0.95*'Property Info'!$E$16),\"maybe partial\",\"\")","v":""},"",0,{"$f":"IF(AND(ISNUMBER(SEARCH(\"apartment\",I11)), M11<'Property Info'!$G$23), 1, 0)","v":0}]
[8,{"$f":"IFERROR(INDEX(EWEMdat!D:D,SMALL(IF(ewem_bp_ids=SecurityKey!$C$2,ROW(ewem_bp_ids)-MIN(ROW(ewem_bp_ids))+1),EWEMs!$A12)),\"\")","v":""},{"$f":"IFERROR(INDEX(EWEMdat!F:F,SMALL(IF(ewem_bp_ids=SecurityKey!$C$2,ROW(ewem_bp_ids)-MIN(ROW(ewem_bp_ids))+1),EWEMs!$A12)),\"\")","v":""},{"$f":"IFERROR(INDEX(EWEMdat!G:G,SMALL(IF(ewem_bp_ids=SecurityKey!$C$2,ROW(ewem_bp_ids)-MIN(ROW(ewem_bp_ids))+1),EWEMs!$A12)),\"\")&IFERROR(\" - \"&U12,\"\")","v":""},null,{"$f":"IFERROR(INDEX(EWEMdat!K:K,SMALL(IF(ewem_bp_ids=SecurityKey!$C$2,ROW(ewem_bp_ids)-MIN(ROW(ewem_bp_ids))+1),EWEMs!$A12)),\"\")","v":""},null,null,{"$f":"IFERROR(INDEX(EWEMdat!H:H,SMALL(IF(ewem_bp_ids=SecurityKey!$C$2,ROW(ewem_bp_ids)-MIN(ROW(ewem_bp_ids))+1),EWEMs!$A12)),\"\")","v":""},{"$f":"IFERROR(INDEX(EWEMdat!I:I,SMALL(IF(ewem_bp_ids=SecurityKey!$C$2,ROW(ewem_bp_ids)-MIN(ROW(ewem_bp_ids))+1),EWEMs!$A12)),\"\")","v":""},{"$f":"IFERROR(INDEX(EWEMdat!J:J,SMALL(IF(ewem_bp_ids=SecurityKey!$C$2,ROW(ewem_bp_ids)-MIN(ROW(ewem_bp_ids))+1),EWEMs!$A12)),\"\")","v":""},null,{"$f":"IF(C12<>\"\",COUNTIF(Observations!$D$7:$D$506,EWEMs!W12),\"\")","v":""},{"$f":"IF(C12<>\"\",COUNTIF(Observations!L$7:L$506,EWEMs!W12&\"noncompliant\"),\"\")","v":""},"","",null,null,null,null,{"$f":"VLOOKUP(C12,Data!A:I,9,FALSE)","v":{"$error":"#N/A"}},{"$f":"IF(AND(OR(I12=\"Apartments and Common Areas\", I12=\"Apartments\"),K12<0.95*'Property Info'!$E$16),\"maybe partial\",\"\")","v":""},"",0,{"$f":"IF(AND(ISNUMBER(SEARCH(\"apartment\",I12)), M12<'Property Info'!$G$23), 1, 0)","v":0}]
[9,{"$f":"IFERROR(INDEX(EWEMdat!D:D,SMALL(IF(ewem_bp_ids=SecurityKey!$C$2,ROW(ewem_bp_ids)-MIN(ROW(ewem_bp_ids))+1),EWEMs!$A13)),\"\")","v":""},{"$f":"IFERROR(INDEX(EWEMdat!F:F,SMALL(IF(ewem_bp_ids=SecurityKey!$C$2,ROW(ewem_bp_ids)-MIN(ROW(ewem_bp_ids))+1),EWEMs!$A13)),\"\")","v":""},{"$f":"IFERROR(INDEX(EWEMdat!G:G,SMALL(IF(ewem_bp_ids=SecurityKey!$C$2,ROW(ewem_bp_ids)-MIN(ROW(ewem_bp_ids))+1),EWEMs!$A13)),\"\")&IFERROR(\" - \"&U13,\"\")","v":""},null,{"$f":"IFERROR(INDEX(EWEMdat!K:K,SMALL(IF(ewem_bp_ids=SecurityKey!$C$2,ROW(ewem_bp_ids)-MIN(ROW(ewem_bp_ids))+1),EWEMs!$A13)),\"\")","v":""},null,null,{"$f":"IFERROR(INDEX(EWEMdat!H:H,SMALL(IF(ewem_bp_ids=SecurityKey!$C$2,ROW(ewem_bp_ids)-MIN(ROW(ewem_bp_ids))+1),EWEMs!$A13)),\"\")","v":""},{"$f":"IFERROR(INDEX(EWEMdat!I:I,SMALL(IF(ewem_bp_ids=SecurityKey!$C$2,ROW(ewem_bp_ids)-MIN(ROW(ewem_bp_ids))+1),EWEMs!$A13)),\"\")","v":""},{"$f":"IFERROR(INDEX(EWEMdat!J:J,SMALL(IF(ewem_bp_ids=SecurityKey!$C$2,ROW(ewem_bp_ids)-MIN(ROW(ewem_bp_ids))+1),EWEMs!$A13)),\"\")","v":""},null,{"$f":"IF(C13<>\"\",COUNTIF(Observations!$D$7:$D$506,EWEMs!W13),\"\")","v":""},{"$f":"IF(C13<>\"\",COUNTIF(Observations!L$7:L$506,EWEMs!W13&\"noncompliant\"),\"\")","v":""},"","",null,null,null,null,{"$f":"VLOOKUP(C13,Data!A:I,9,FALSE)","v":{"$error":"#N/A"}},{"$f":"IF(AND(OR(I13=\"Apartments and Common Areas\", I13=\"Apartments\"),K13<0.95*'Property Info'!$E$16),\"maybe partial\",\"\")","v":""},"",0,{"$f":"IF(AND(ISNUMBER(SEARCH(\"apartment\",I13)), M13<'Property Info'!$G$23), 1, 0)","v":0}]
[10,{"$f":"IFERROR(INDEX(EWEMdat!D:D,SMALL(IF(ewem_bp_ids=SecurityKey!$C$2,ROW(ewem_bp_ids)-MIN(ROW(ewem_bp_ids))+1),EWEMs!$A14)),\"\")","v":""},{"$f":"IFERROR(INDEX(EWEMdat!F:F,SMALL(IF(ewem_bp_ids=SecurityKey!$C$2,ROW(ewem_bp_ids)-MIN(ROW(ewem_bp_ids))+1),EWEMs!$A14)),\"\")","v":""},{"$f":"IFERROR(INDEX(EWEMdat!G:G,SMALL(IF(ewem_bp_ids=SecurityKey!$C$2,ROW(ewem_bp_ids)-MIN(ROW(ewem_bp_ids))+1),EWEMs!$A14)),\"\")&IFERROR(\" - \"&U14,\"\")","v":""},null,{"$f":"IFERROR(INDEX(EWEMdat!K:K,SMALL(IF(ewem_bp_ids=SecurityKey!$C$2,ROW(ewem_bp_ids)-MIN(ROW(ewem_bp_ids))+1),EWEMs!$A14)),\"\")","v":""},null,null,{"$f":"IFERROR(INDEX(EWEMdat!H:H,SMALL(IF(ewem_bp_ids=SecurityKey!$C$2,ROW(ewem_bp_ids)-MIN(ROW(ewem_bp_ids))+1),EWEMs!$A14)),\"\")","v":""},{"$f":"IFERROR(INDEX(EWEMdat!I:I,SMALL(IF(ewem_bp_ids=SecurityKey!$C$2,ROW(ewem_bp_ids)-MIN(ROW(ewem_bp_ids))+1),EWEMs!$A14)),\"\")","v":""},{"$f":"IFERROR(INDEX(EWEMdat!J:J,SMALL(IF(ewem_bp_ids=SecurityKey!$C$2,ROW(ewem_bp_ids)-MIN(ROW(ewem_bp_ids))+1),EWEMs!$A14)),\"\")","v":""},null,{"$f":"IF(C14<>\"\",COUNTIF(Observations!$D$7:$D$506,EWEMs!W14),\"\")","v":""},{"$f":"IF(C14<>\"\",COUNTIF(Observations!L$7:L$506,EWEMs!W14&\"noncompliant\"),\"\")","v":""},"","",null,null,null,null,{"$f":"VLOOKUP(C14,Data!A:I,9,FALSE)","v":{"$error":"#N/A"}},{"$f":"IF(AND(OR(I14=\"Apartments and Common Areas\", I14=\"Apartments\"),K14<0.95*'Property Info'!$E$16),\"maybe partial\",\"\")","v":""},"",0,{"$f":"IF(AND(ISNUMBER(SEARCH(\"apartment\",I14)), M14<'Property Info'!$G$23), 1, 0)","v":0}]
[11,{"$f":"IFERROR(INDEX(EWEMdat!D:D,SMALL(IF(ewem_bp_ids=SecurityKey!$C$2,ROW(ewem_bp_ids)-MIN(ROW(ewem_bp_ids))+1),EWEMs!$A15)),\"\")","v":""},{"$f":"IFERROR(INDEX(EWEMdat!F:F,SMALL(IF(ewem_bp_ids=SecurityKey!$C$2,ROW(ewem_bp_ids)-MIN(ROW(ewem_bp_ids))+1),EWEMs!$A15)),\"\")","v":""},{"$f":"IFERROR(INDEX(EWEMdat!G:G,SMALL(IF(ewem_bp_ids=SecurityKey!$C$2,ROW(ewem_bp_ids)-MIN(ROW(ewem_bp_ids))+1),EWEMs!$A15)),\"\")&IFERROR(\" - \"&U15,\"\")","v":""},null,{"$f":"IFERROR(INDEX(EWEMdat!K:K,SMALL(IF(ewem_bp_ids=SecurityKey!$C$2,ROW(ewem_bp_ids)-MIN(ROW(ewem_bp_ids))+1),EWEMs!$A15)),\"\")","v":""},null,null,{"$f":"IFERROR(INDEX(EWEMdat!H:H,SMALL(IF(ewem_bp_ids=SecurityKey!$C$2,ROW(ewem_bp_ids)-MIN(ROW(ewem_bp_ids))+1),EWEMs!$A15)),\"\")","v":""},{"$f":"IFERROR(INDEX(EWEMdat!I:I,SMALL(IF(ewem_bp_ids=SecurityKey!$C$2,ROW(ewem_bp_ids)-MIN(ROW(ewem_bp_ids))+1),EWEMs!$A15)),\"\")","v":""},{"$f":"IFERROR(INDEX(EWEMdat!J:J,SMALL(IF(ewem_bp_ids=SecurityKey!$C$2,ROW(ewem_bp_ids)-MIN(ROW(ewem_bp_ids))+1),EWEMs!$A15)),\"\")","v":""},null,{"$f":"IF(C15<>\"\",COUNTIF(Observations!$D$7:$D$506,EWEMs!W15),\"\")","v":""},{"$f":"IF(C15<>\"\",COUNTIF(Observations!L$7:L$506,EWEMs!W15&\"noncompliant\"),\"\")","v":""},"","",null,null,null,null,{"$f":"VLOOKUP(C15,Data!A:I,9,FALSE)","v":{"$error":"#N/A"}},{"$f":"IF(AND(OR(I15=\"Apartments and Common Areas\", I15=\"Apartments\"),K15<0.95*'Property Info'!$E$16),\"maybe partial\",\"\")","v":""},"",0,{"$f":"IF(AND(ISNUMBER(SEARCH(\"apartment\",I15)), M15<'Property Info'!$G$23), 1, 0)","v":0}]
[12,{"$f":"IFERROR(INDEX(EWEMdat!D:D,SMALL(IF(ewem_bp_ids=SecurityKey!$C$2,ROW(ewem_bp_ids)-MIN(ROW(ewem_bp_ids))+1),EWEMs!$A16)),\"\")","v":""},{"$f":"IFERROR(INDEX(EWEMdat!F:F,SMALL(IF(ewem_bp_ids=SecurityKey!$C$2,ROW(ewem_bp_ids)-MIN(ROW(ewem_bp_ids))+1),EWEMs!$A16)),\"\")","v":""},{"$f":"IFERROR(INDEX(EWEMdat!G:G,SMALL(IF(ewem_bp_ids=SecurityKey!$C$2,ROW(ewem_bp_ids)-MIN(ROW(ewem_bp_ids))+1),EWEMs!$A16)),\"\")&IFERROR(\" - \"&U16,\"\")","v":""},null,{"$f":"IFERROR(INDEX(EWEMdat!K:K,SMALL(IF(ewem_bp_ids=SecurityKey!$C$2,ROW(ewem_bp_ids)-MIN(ROW(ewem_bp_ids))+1),EWEMs!$A16)),\"\")","v":""},null,null,{"$f":"IFERROR(INDEX(EWEMdat!H:H,SMALL(IF(ewem_bp_ids=SecurityKey!$C$2,ROW(ewem_bp_ids)-MIN(ROW(ewem_bp_ids))+1),EWEMs!$A16)),\"\")","v":""},{"$f":"IFERROR(INDEX(EWEMdat!I:I,SMALL(IF(ewem_bp_ids=SecurityKey!$C$2,ROW(ewem_bp_ids)-MIN(ROW(ewem_bp_ids))+1),EWEMs!$A16)),\"\")","v":""},{"$f":"IFERROR(INDEX(EWEMdat!J:J,SMALL(IF(ewem_bp_ids=SecurityKey!$C$2,ROW(ewem_bp_ids)-MIN(ROW(ewem_bp_ids))+1),EWEMs!$A16)),\"\")","v":""},null,{"$f":"IF(C16<>\"\",COUNTIF(Observations!$D$7:$D$506,EWEMs!W16),\"\")","v":""},{"$f":"IF(C16<>\"\",COUNTIF(Observations!L$7:L$506,EWEMs!W16&\"noncompliant\"),\"\")","v":""},"","",null,null,null,null,{"$f":"VLOOKUP(C16,Data!A:I,9,FALSE)","v":{"$error":"#N/A"}},{"$f":"IF(AND(OR(I16=\"Apartments and Common Areas\", I16=\"Apartments\"),K16<0.95*'Property Info'!$E$16),\"maybe partial\",\"\")","v":""},"",0,{"$f":"IF(AND(ISNUMBER(SEARCH(\"apartment\",I16)), M16<'Property Info'!$G$23), 1, 0)","v":0}]
[13,{"$f":"IFERROR(INDEX(EWEMdat!D:D,SMALL(IF(ewem_bp_ids=SecurityKey!$C$2,ROW(ewem_bp_ids)-MIN(ROW(ewem_bp_ids))+1),EWEMs!$A17)),\"\")","v":""},{"$f":"IFERROR(INDEX(EWEMdat!F:F,SMALL(IF(ewem_bp_ids=SecurityKey!$C$2,ROW(ewem_bp_ids)-MIN(ROW(ewem_bp_ids))+1),EWEMs!$A17)),\"\")","v":""},{"$f":"IFERROR(INDEX(EWEMdat!G:G,SMALL(IF(ewem_bp_ids=SecurityKey!$C$2,ROW(ewem_bp_ids)-MIN(ROW(ewem_bp_ids))+1),EWEMs!$A17)),\"\")&IFERROR(\" - \"&U17,\"\")","v":""},null,{"$f":"IFERROR(INDEX(EWEMdat!K:K,SMALL(IF(ewem_bp_ids=SecurityKey!$C$2,ROW(ewem_bp_ids)-MIN(ROW(ewem_bp_ids))+1),EWEMs!$A17)),\"\")","v":""},null,null,{"$f":"IFERROR(INDEX(EWEMdat!H:H,SMALL(IF(ewem_bp_ids=SecurityKey!$C$2,ROW(ewem_bp_ids)-MIN(ROW(ewem_bp_ids))+1),EWEMs!$A17)),\"\")","v":""},{"$f":"IFERROR(INDEX(EWEMdat!I:I,SMALL(IF(ewem_bp_ids=SecurityKey!$C$2,ROW(ewem_bp_ids)-MIN(ROW(ewem_bp_ids))+1),EWEMs!$A17)),\"\")","v":""},{"$f":"IFERROR(INDEX(EWEMdat!J:J,SMALL(IF(ewem_bp_ids=SecurityKey!$C$2,ROW(ewem_bp_ids)-MIN(ROW(ewem_bp_ids))+1),EWEMs!$A17)),\"\")","v":""},null,{"$f":"IF(C17<>\"\",COUNTIF(Observations!$D$7:$D$506,EWEMs!W17),\"\")","v":""},{"$f":"IF(C17<>\"\",COUNTIF(Observations!L$7:L$506,EWEMs!W17&\"noncompliant\"),\"\")","v":""},"","",null,null,null,null,{"$f":"VLOOKUP(C17,Data!A:I,9,FALSE)","v":{"$error":"#N/A"}},{"$f":"IF(AND(OR(I17=\"Apartments and Common Areas\", I17=\"Apartments\"),K17<0.95*'Property Info'!$E$16),\"maybe partial\",\"\")","v":""},"",0,{"$f":"IF(AND(ISNUMBER(SEARCH(\"apartment\",I17)), M17<'Property Info'!$G$23), 1, 0)","v":0}]
[14,{"$f":"IFERROR(INDEX(EWEMdat!D:D,SMALL(IF(ewem_bp_ids=SecurityKey!$C$2,ROW(ewem_bp_ids)-MIN(ROW(ewem_bp_ids))+1),EWEMs!$A18)),\"\")","v":""},{"$f":"IFERROR(INDEX(EWEMdat!F:F,SMALL(IF(ewem_bp_ids=SecurityKey!$C$2,ROW(ewem_bp_ids)-MIN(ROW(ewem_bp_ids))+1),EWEMs!$A18)),\"\")","v":""},{"$f":"IFERROR(INDEX(EWEMdat!G:G,SMALL(IF(ewem_bp_ids=SecurityKey!$C$2,ROW(ewem_bp_ids)-MIN(ROW(ewem_bp_ids))+1),EWEMs!$A18)),\"\")&IFERROR(\" - \"&U18,\"\")","v":""},null,{"$f":"IFERROR(INDEX(EWEMdat!K:K,SMALL(IF(ewem_bp_ids=SecurityKey!$C$2,ROW(ewem_bp_ids)-MIN(ROW(ewem_bp_ids))+1),EWEMs!$A18)),\"\")","v":""},null,null,{"$f":"IFERROR(INDEX(EWEMdat!H:H,SMALL(IF(ewem_bp_ids=SecurityKey!$C$2,ROW(ewem_bp_ids)-MIN(ROW(ewem_bp_ids))+1),EWEMs!$A18)),\"\")","v":""},{"$f":"IFERROR(INDEX(EWEMdat!I:I,SMALL(IF(ewem_bp_ids=SecurityKey!$C$2,ROW(ewem_bp_ids)-MIN(ROW(ewem_bp_ids))+1),EWEMs!$A18)),\"\")","v":""},{"$f":"IFERROR(INDEX(EWEMdat!J:J,SMALL(IF(ewem_bp_ids=SecurityKey!$C$2,ROW(ewem_bp_ids)-MIN(ROW(ewem_bp_ids))+1),EWEMs!$A18)),\"\")","v":""},null,{"$f":"IF(C18<>\"\",COUNTIF(Observations!$D$7:$D$506,EWEMs!W18),\"\")","v":""},{"$f":"IF(C18<>\"\",COUNTIF(Observations!L$7:L$506,EWEMs!W18&\"noncompliant\"),\"\")","v":""},"","",null,null,null,null,{"$f":"VLOOKUP(C18,Data!A:I,9,FALSE)","v":{"$error":"#N/A"}},{"$f":"IF(AND(OR(I18=\"Apartments and Common Areas\", I18=\"Apartments\"),K18<0.95*'Property Info'!$E$16),\"maybe partial\",\"\")","v":""},"",0,{"$f":"IF(AND(ISNUMBER(SEARCH(\"apartment\",I18)), M18<'Property Info'!$G$23), 1, 0)","v":0}]
[15,{"$f":"IFERROR(INDEX(EWEMdat!D:D,SMALL(IF(ewem_bp_ids=SecurityKey!$C$2,ROW(ewem_bp_ids)-MIN(ROW(ewem_bp_ids))+1),EWEMs!$A19)),\"\")","v":""},{"$f":"IFERROR(INDEX(EWEMdat!F:F,SMALL(IF(ewem_bp_ids=SecurityKey!$C$2,ROW(ewem_bp_ids)-MIN(ROW(ewem_bp_ids))+1),EWEMs!$A19)),\"\")","v":""},{"$f":"IFERROR(INDEX(EWEMdat!G:G,SMALL(IF(ewem_bp_ids=SecurityKey!$C$2,ROW(ewem_bp_ids)-MIN(ROW(ewem_bp_ids))+1),EWEMs!$A19)),\"\")&IFERROR(\" - \"&U19,\"\")","v":""},null,{"$f":"IFERROR(INDEX(EWEMdat!K:K,SMALL(IF(ewem_bp_ids=SecurityKey!$C$2,ROW(ewem_bp_ids)-MIN(ROW(ewem_bp_ids))+1),EWEMs!$A19)),\"\")","v":""},null,null,{"$f":"IFERROR(INDEX(EWEMdat!H:H,SMALL(IF(ewem_bp_ids=SecurityKey!$C$2,ROW(ewem_bp_ids)-MIN(ROW(ewem_bp_ids))+1),EWEMs!$A19)),\"\")","v":""},{"$f":"IFERROR(INDEX(EWEMdat!I:I,SMALL(IF(ewem_bp_ids=SecurityKey!$C$2,ROW(ewem_bp_ids)-MIN(ROW(ewem_bp_ids))+1),EWEMs!$A19)),\"\")","v":""},{"$f":"IFERROR(INDEX(EWEMdat!J:J,SMALL(IF(ewem_bp_ids=SecurityKey!$C$2,ROW(ewem_bp_ids)-MIN(ROW(ewem_bp_ids))+1),EWEMs!$A19)),\"\")","v":""},null,{"$f":"IF(C19<>\"\",COUNTIF(Observations!$D$7:$D$506,EWEMs!W19),\"\")","v":""},{"$f":"IF(C19<>\"\",COUNTIF(Observations!L$7:L$506,EWEMs!W19&\"noncompliant\"),\"\")","v":""},"","",null,null,null,null,{"$f":"VLOOKUP(C19,Data!A:I,9,FALSE)","v":{"$error":"#N/A"}},{"$f":"IF(AND(OR(I19=\"Apartments and Common Areas\", I19=\"Apartments\"),K19<0.95*'Property Info'!$E$16),\"maybe partial\",\"\")","v":""},"",0,{"$f":"IF(AND(ISNUMBER(SEARCH(\"apartment\",I19)), M19<'Property Info'!$G$23), 1, 0)","v":0}]
[16,{"$f":"IFERROR(INDEX(EWEMdat!D:D,SMALL(IF(ewem_bp_ids=SecurityKey!$C$2,ROW(ewem_bp_ids)-MIN(ROW(ewem_bp_ids))+1),EWEMs!$A20)),\"\")","v":""},{"$f":"IFERROR(INDEX(EWEMdat!F:F,SMALL(IF(ewem_bp_ids=SecurityKey!$C$2,ROW(ewem_bp_ids)-MIN(ROW(ewem_bp_ids))+1),EWEMs!$A20)),\"\")","v":""},{"$f":"IFERROR(INDEX(EWEMdat!G:G,SMALL(IF(ewem_bp_ids=SecurityKey!$C$2,ROW(ewem_bp_ids)-MIN(ROW(ewem_bp_ids))+1),EWEMs!$A20)),\"\")&IFERROR(\" - \"&U20,\"\")","v":""},null,{"$f":"IFERROR(INDEX(EWEMdat!K:K,SMALL(IF(ewem_bp_ids=SecurityKey!$C$2,ROW(ewem_bp_ids)-MIN(ROW(ewem_bp_ids))+1),EWEMs!$A20)),\"\")","v":""},null,null,{"$f":"IFERROR(INDEX(EWEMdat!H:H,SMALL(IF(ewem_bp_ids=SecurityKey!$C$2,ROW(ewem_bp_ids)-MIN(ROW(ewem_bp_ids))+1),EWEMs!$A20)),\"\")","v":""},{"$f":"IFERROR(INDEX(EWEMdat!I:I,SMALL(IF(ewem_bp_ids=SecurityKey!$C$2,ROW(ewem_bp_ids)-MIN(ROW(ewem_bp_ids))+1),EWEMs!$A20)),\"\")","v":""},{"$f":"IFERROR(INDEX(EWEMdat!J:J,SMALL(IF(ewem_bp_ids=SecurityKey!$C$2,ROW(ewem_bp_ids)-MIN(ROW(ewem_bp_ids))+1),EWEMs!$A20)),\"\")","v":""},null,{"$f":"IF(C20<>\"\",COUNTIF(Observations!$D$7:$D$506,EWEMs!W20),\"\")","v":""},{"$f":"IF(C20<>\"\",COUNTIF(Observations!L$7:L$506,EWEMs!W20&\"noncompliant\"),\"\")","v":""},"","",null,null,null,null,{"$f":"VLOOKUP(C20,Data!A:I,9,FALSE)","v":{"$error":"#N/A"}},{"$f":"IF(AND(OR(I20=\"Apartments and Common Areas\", I20=\"Apartments\"),K20<0.95*'Property Info'!$E$16),\"maybe partial\",\"\")","v":""},"",0,{"$f":"IF(AND(ISNUMBER(SEARCH(\"apartment\",I20)), M20<'Property Info'!$G$23), 1, 0)","v":0}]
[17,{"$f":"IFERROR(INDEX(EWEMdat!D:D,SMALL(IF(ewem_bp_ids=SecurityKey!$C$2,ROW(ewem_bp_ids)-MIN(ROW(ewem_bp_ids))+1),EWEMs!$A21)),\"\")","v":""},{"$f":"IFERROR(INDEX(EWEMdat!F:F,SMALL(IF(ewem_bp_ids=SecurityKey!$C$2,ROW(ewem_bp_ids)-MIN(ROW(ewem_bp_ids))+1),EWEMs!$A21)),\"\")","v":""},{"$f":"IFERROR(INDEX(EWEMdat!G:G,SMALL(IF(ewem_bp_ids=SecurityKey!$C$2,ROW(ewem_bp_ids)-MIN(ROW(ewem_bp_ids))+1),EWEMs!$A21)),\"\")&IFERROR(\" - \"&U21,\"\")","v":""},null,{"$f":"IFERROR(INDEX(EWEMdat!K:K,SMALL(IF(ewem_bp_ids=SecurityKey!$C$2,ROW(ewem_bp_ids)-MIN(ROW(ewem_bp_ids))+1),EWEMs!$A21)),\"\")","v":""},null,null,{"$f":"IFERROR(INDEX(EWEMdat!H:H,SMALL(IF(ewem_bp_ids=SecurityKey!$C$2,ROW(ewem_bp_ids)-MIN(ROW(ewem_bp_ids))+1),EWEMs!$A21)),\"\")","v":""},{"$f":"IFERROR(INDEX(EWEMdat!I:I,SMALL(IF(ewem_bp_ids=SecurityKey!$C$2,ROW(ewem_bp_ids)-MIN(ROW(ewem_bp_ids))+1),EWEMs!$A21)),\"\")","v":""},{"$f":"IFERROR(INDEX(EWEMdat!J:J,SMALL(IF(ewem_bp_ids=SecurityKey!$C$2,ROW(ewem_bp_ids)-MIN(ROW(ewem_bp_ids))+1),EWEMs!$A21)),\"\")","v":""},null,{"$f":"IF(C21<>\"\",COUNTIF(Observations!$D$7:$D$506,EWEMs!W21),\"\")","v":""},{"$f":"IF(C21<>\"\",COUNTIF(Observations!L$7:L$506,EWEMs!W21&\"noncompliant\"),\"\")","v":""},"","",null,null,null,null,{"$f":"VLOOKUP(C21,Data!A:I,9,FALSE)","v":{"$error":"#N/A"}},{"$f":"IF(AND(OR(I21=\"Apartments and Common Areas\", I21=\"Apartments\"),K21<0.95*'Property Info'!$E$16),\"maybe partial\",\"\")","v":""},"",0,{"$f":"IF(AND(ISNUMBER(SEARCH(\"apartment\",I21)), M21<'Property Info'!$G$23), 1, 0)","v":0}]
[18,{"$f":"IFERROR(INDEX(EWEMdat!D:D,SMALL(IF(ewem_bp_ids=SecurityKey!$C$2,ROW(ewem_bp_ids)-MIN(ROW(ewem_bp_ids))+1),EWEMs!$A22)),\"\")","v":""},{"$f":"IFERROR(INDEX(EWEMdat!F:F,SMALL(IF(ewem_bp_ids=SecurityKey!$C$2,ROW(ewem_bp_ids)-MIN(ROW(ewem_bp_ids))+1),EWEMs!$A22)),\"\")","v":""},{"$f":"IFERROR(INDEX(EWEMdat!G:G,SMALL(IF(ewem_bp_ids=SecurityKey!$C$2,ROW(ewem_bp_ids)-MIN(ROW(ewem_bp_ids))+1),EWEMs!$A22)),\"\")&IFERROR(\" - \"&U22,\"\")","v":""},null,{"$f":"IFERROR(INDEX(EWEMdat!K:K,SMALL(IF(ewem_bp_ids=SecurityKey!$C$2,ROW(ewem_bp_ids)-MIN(ROW(ewem_bp_ids))+1),EWEMs!$A22)),\"\")","v":""},null,null,{"$f":"IFERROR(INDEX(EWEMdat!H:H,SMALL(IF(ewem_bp_ids=SecurityKey!$C$2,ROW(ewem_bp_ids)-MIN(ROW(ewem_bp_ids))+1),EWEMs!$A22)),\"\")","v":""},{"$f":"IFERROR(INDEX(EWEMdat!I:I,SMALL(IF(ewem_bp_ids=SecurityKey!$C$2,ROW(ewem_bp_ids)-MIN(ROW(ewem_bp_ids))+1),EWEMs!$A22)),\"\")","v":""},{"$f":"IFERROR(INDEX(EWEMdat!J:J,SMALL(IF(ewem_bp_ids=SecurityKey!$C$2,ROW(ewem_bp_ids)-MIN(ROW(ewem_bp_ids))+1),EWEMs!$A22)),\"\")","v":""},null,{"$f":"IF(C22<>\"\",COUNTIF(Observations!$D$7:$D$506,EWEMs!W22),\"\")","v":""},{"$f":"IF(C22<>\"\",COUNTIF(Observations!L$7:L$506,EWEMs!W22&\"noncompliant\"),\"\")","v":""},"","",null,null,null,null,{"$f":"VLOOKUP(C22,Data!A:I,9,FALSE)","v":{"$error":"#N/A"}},{"$f":"IF(AND(OR(I22=\"Apartments and Common Areas\", I22=\"Apartments\"),K22<0.95*'Property Info'!$E$16),\"maybe partial\",\"\")","v":""},"",0,{"$f":"IF(AND(ISNUMBER(SEARCH(\"apartment\",I22)), M22<'Property Info'!$G$23), 1, 0)","v":0}]
[19,{"$f":"IFERROR(INDEX(EWEMdat!D:D,SMALL(IF(ewem_bp_ids=SecurityKey!$C$2,ROW(ewem_bp_ids)-MIN(ROW(ewem_bp_ids))+1),EWEMs!$A23)),\"\")","v":""},{"$f":"IFERROR(INDEX(EWEMdat!F:F,SMALL(IF(ewem_bp_ids=SecurityKey!$C$2,ROW(ewem_bp_ids)-MIN(ROW(ewem_bp_ids))+1),EWEMs!$A23)),\"\")","v":""},{"$f":"IFERROR(INDEX(EWEMdat!G:G,SMALL(IF(ewem_bp_ids=SecurityKey!$C$2,ROW(ewem_bp_ids)-MIN(ROW(ewem_bp_ids))+1),EWEMs!$A23)),\"\")&IFERROR(\" - \"&U23,\"\")","v":""},null,{"$f":"IFERROR(INDEX(EWEMdat!K:K,SMALL(IF(ewem_bp_ids=SecurityKey!$C$2,ROW(ewem_bp_ids)-MIN(ROW(ewem_bp_ids))+1),EWEMs!$A23)),\"\")","v":""},null,null,{"$f":"IFERROR(INDEX(EWEMdat!H:H,SMALL(IF(ewem_bp_ids=SecurityKey!$C$2,ROW(ewem_bp_ids)-MIN(ROW(ewem_bp_ids))+1),EWEMs!$A23)),\"\")","v":""},{"$f":"IFERROR(INDEX(EWEMdat!I:I,SMALL(IF(ewem_bp_ids=SecurityKey!$C$2,ROW(ewem_bp_ids)-MIN(ROW(ewem_bp_ids))+1),EWEMs!$A23)),\"\")","v":""},{"$f":"IFERROR(INDEX(EWEMdat!J:J,SMALL(IF(ewem_bp_ids=SecurityKey!$C$2,ROW(ewem_bp_ids)-MIN(ROW(ewem_bp_ids))+1),EWEMs!$A23)),\"\")","v":""},null,{"$f":"IF(C23<>\"\",COUNTIF(Observations!$D$7:$D$506,EWEMs!W23),\"\")","v":""},{"$f":"IF(C23<>\"\",COUNTIF(Observations!L$7:L$506,EWEMs!W23&\"noncompliant\"),\"\")","v":""},"","",null,null,null,null,{"$f":"VLOOKUP(C23,Data!A:I,9,FALSE)","v":{"$error":"#N/A"}},{"$f":"IF(AND(OR(I23=\"Apartments and Common Areas\", I23=\"Apartments\"),K23<0.95*'Property Info'!$E$16),\"maybe partial\",\"\")","v":""},"",0,{"$f":"IF(AND(ISNUMBER(SEARCH(\"apartment\",I23)), M23<'Property Info'!$G$23), 1, 0)","v":0}]
[20,{"$f":"IFERROR(INDEX(EWEMdat!D:D,SMALL(IF(ewem_bp_ids=SecurityKey!$C$2,ROW(ewem_bp_ids)-MIN(ROW(ewem_bp_ids))+1),EWEMs!$A24)),\"\")","v":""},{"$f":"IFERROR(INDEX(EWEMdat!F:F,SMALL(IF(ewem_bp_ids=SecurityKey!$C$2,ROW(ewem_bp_ids)-MIN(ROW(ewem_bp_ids))+1),EWEMs!$A24)),\"\")","v":""},{"$f":"IFERROR(INDEX(EWEMdat!G:G,SMALL(IF(ewem_bp_ids=SecurityKey!$C$2,ROW(ewem_bp_ids)-MIN(ROW(ewem_bp_ids))+1),EWEMs!$A24)),\"\")&IFERROR(\" - \"&U24,\"\")","v":""},null,{"$f":"IFERROR(INDEX(EWEMdat!K:K,SMALL(IF(ewem_bp_ids=SecurityKey!$C$2,ROW(ewem_bp_ids)-MIN(ROW(ewem_bp_ids))+1),EWEMs!$A24)),\"\")","v":""},null,null,{"$f":"IFERROR(INDEX(EWEMdat!H:H,SMALL(IF(ewem_bp_ids=SecurityKey!$C$2,ROW(ewem_bp_ids)-MIN(ROW(ewem_bp_ids))+1),EWEMs!$A24)),\"\")","v":""},{"$f":"IFERROR(INDEX(EWEMdat!I:I,SMALL(IF(ewem_bp_ids=SecurityKey!$C$2,ROW(ewem_bp_ids)-MIN(ROW(ewem_bp_ids))+1),EWEMs!$A24)),\"\")","v":""},{"$f":"IFERROR(INDEX(EWEMdat!J:J,SMALL(IF(ewem_bp_ids=SecurityKey!$C$2,ROW(ewem_bp_ids)-MIN(ROW(ewem_bp_ids))+1),EWEMs!$A24)),\"\")","v":""},null,{"$f":"IF(C24<>\"\",COUNTIF(Observations!$D$7:$D$506,EWEMs!W24),\"\")","v":""},{"$f":"IF(C24<>\"\",COUNTIF(Observations!L$7:L$506,EWEMs!W24&\"noncompliant\"),\"\")","v":""},"","",null,null,null,null,{"$f":"VLOOKUP(C24,Data!A:I,9,FALSE)","v":{"$error":"#N/A"}},{"$f":"IF(AND(OR(I24=\"Apartments and Common Areas\", I24=\"Apartments\"),K24<0.95*'Property Info'!$E$16),\"maybe partial\",\"\")","v":""},"",0,{"$f":"IF(AND(ISNUMBER(SEARCH(\"apartment\",I24)), M24<'Property Info'!$G$23), 1, 0)","v":0}]

{"sheet":"Units and Spaces","index":3,"n_rows":143,"n_cols":7,"rows_kept":143,"cut":false,"hidden":false,"merged":[]}
[null,"INPUT: Units and Spaces Inspected"]
[null,"Instructions:  List all unique spaces inspected, including all apartment units and common areas. Correct any duplicate space names before recording inspection observations. Do not leave any spaces in the list."]
[]
[null,"Minimum number of units to inspect:",{"$f":"ROUND(IF('Property Info'!E16<20,3,IF('Property Info'!E16>600,30,IF('Property Info'!E16<56,5,IF('Property Info'!E16<100,'Property Info'!E16*0.1,IF('Property Info'!E16<201,10,'Property Info'!E16*0.05))))),0)","v":10}]
[null,"Number of units recorded:",{"$f":"ROUND(SUMPRODUCT(1/COUNTIF(F7:F143,F7:F143&\"\"))-1,0)","v":0},null,null,"apartments","all spaces"]
[null,"Unit # or Space name","Space Type","Notes (optional)"]
[null,null,null,null,{"$f":"IF(AND(B7=\"\",B8<>\"\"),\"No blanks, please! They create errors\",\"\")","v":""},{"$f":"IF(C7=\"Apartment\",IF(B7=0,\"\",B7),\"\")","v":""},{"$f":"IF(B7<>\"\",B7,\"\")","v":""}]
[null,null,null,null,{"$f":"IF(AND(B8=\"\",B9<>\"\"),\"No blanks, please! They create errors\",\"\")","v":""},{"$f":"IF(C8=\"Apartment\",IF(B8=0,\"\",B8),\"\")","v":""},{"$f":"IF(B8<>\"\",B8,\"\")","v":""}]
[null,null,null,null,"","",""]
[null,null,null,null,"","",""]
[null,null,null,null,"","",""]
[null,null,null,null,"","",""]
[null,null,null,null,"","",""]
[null,null,null,null,"","",""]
[null,null,null,null,"","",""]
[null,null,null,null,"","",""]
[null,null,null,null,"","",""]
[null,null,null,null,"","",""]
[null,null,null,null,"","",""]
[null,null,null,null,"","",""]
[null,null,null,null,"","",""]
[null,null,null,null,"","",""]
[null,null,null,null,"","",""]
[null,null,null,null,"","",""]
[null,null,null,null,"","",""]
[null,null,null,null,"","",""]
[null,null,null,null,"","",""]
[null,null,null,null,"","",""]
[null,null,null,null,"","",""]
[null,null,null,null,"","",""]
[null,null,null,null,"","",""]
[null,null,null,null,"","",""]
[null,null,null,null,"","",""]
[null,null,null,null,"","",""]
[null,null,null,null,"","",""]
[null,null,null,null,"","",""]
[null,null,null,null,"","",""]
[null,null,null,null,"","",""]
[null,null,null,null,"","",""]
[null,null,null,null,"","",""]
[null,null,null,null,"","",""]
[null,null,null,null,"","",""]
[null,null,null,null,"","",""]
[null,null,null,null,"","",""]
[null,null,null,null,"","",""]
[null,null,null,null,"","",""]
[null,null,null,null,"","",""]
[null,null,null,null,"","",""]
[null,null,null,null,"","",""]
[null,null,null,null,"","",""]
[null,null,null,null,"","",""]
[null,null,null,null,"","",""]
[null,null,null,null,"","",""]
[null,null,null,null,"","",""]
[null,null,null,null,"","",""]
[null,null,null,null,"","",""]
[null,null,null,null,"","",""]
[null,null,null,null,"","",""]
[null,null,null,null,"","",""]
[null,null,null,null,"","",""]
[null,null,null,null,"","",""]
[null,null,null,null,"","",""]
[null,null,null,null,"","",""]
[null,null,null,null,"","",""]
[null,null,null,null,"","",""]
[null,null,null,null,"","",""]
[null,null,null,null,"","",""]
[null,null,null,null,"","",""]
[null,null,null,null,"","",""]
[null,null,null,null,"","",""]
[null,null,null,null,"","",""]
[null,null,null,null,{"$f":"IF(AND(B72=\"\",B73<>\"\"),\"No blanks, please! They create errors\",\"\")","v":""},{"$f":"IF(C72=\"Apartment\",IF(B72=0,\"\",B72),\"\")","v":""},{"$f":"IF(B72<>\"\",B72,\"\")","v":""}]
[null,null,null,null,"","",""]
[null,null,null,null,"","",""]
[null,null,null,null,"","",""]
[null,null,null,null,"","",""]
[null,null,null,null,"","",""]
[null,null,null,null,"","",""]
[null,null,null,null,"","",""]
[null,null,null,null,"","",""]
[null,null,null,null,"","",""]
[null,null,null,null,"","",""]
[null,null,null,null,"","",""]
[null,null,null,null,"","",""]
[null,null,null,null,"","",""]
[null,null,null,null,"","",""]
[null,null,null,null,"","",""]
[null,null,null,null,"","",""]
[null,null,null,null,"","",""]
[null,null,null,null,"","",""]
[null,null,null,null,"","",""]
[null,null,null,null,"","",""]
[null,null,null,null,"","",""]
[null,null,null,null,"","",""]
[null,null,null,null,"","",""]
[null,null,null,null,"","",""]
[null,null,null,null,"","",""]
[null,null,null,null,"","",""]
[null,null,null,null,"","",""]
[null,null,null,null,"","",""]
[null,null,null,null,"","",""]
[null,null,null,null,"","",""]
[null,null,null,null,"","",""]
[null,null,null,null,"","",""]
[null,null,null,null,"","",""]
[null,null,null,null,"","",""]
[null,null,null,null,"","",""]
[null,null,null,null,"","",""]
[null,null,null,null,"","",""]
[null,null,null,null,"","",""]
[null,null,null,null,"","",""]
[null,null,null,null,"","",""]
[null,null,null,null,"","",""]
[null,null,null,null,"","",""]
[null,null,null,null,"","",""]
[null,null,null,null,"","",""]
[null,null,null,null,"","",""]
[null,null,null,null,"","",""]
[null,null,null,null,"","",""]
[null,null,null,null,"","",""]
[null,null,null,null,"","",""]
[null,null,null,null,"","",""]
[null,null,null,null,"","",""]
[null,null,null,null,"","",""]
[null,null,null,null,"","",""]
[null,null,null,null,"","",""]
[null,null,null,null,"","",""]
[null,null,null,null,"","",""]
[null,null,null,null,"","",""]
[null,null,null,null,"","",""]
[null,null,null,null,"","",""]
[null,null,null,null,"","",""]
[null,null,null,null,"","",""]
[null,null,null,null,"","",""]
[null,null,null,null,"","",""]
[null,null,null,null,{"$f":"IF(AND(B136=\"\",B137<>\"\"),\"No blanks, please! They create errors\",\"\")","v":""},{"$f":"IF(C136=\"Apartment\",IF(B136=0,\"\",B136),\"\")","v":""},{"$f":"IF(B136<>\"\",B136,\"\")","v":""}]
[null,null,null,null,"","",""]
[null,null,null,null,"","",""]
[null,null,null,null,"","",""]
[null,null,null,null,"","",""]
[null,null,null,null,"","",""]
[null,null,null,null,"","",""]
[null,null,null,null,null,"",""]

{"sheet":"Observations","index":4,"n_rows":506,"n_cols":19,"rows_kept":506,"cut":false,"hidden":false,"merged":[]}
[null,"INPUT: EWEM Observations"]
[null,"Instructions:  Add tests for each EWEM for each space. Water EWEMs require the Nameplate number. You must inspect at least as many units as indicated below in D4. "]
[]
[null,"Minimum number of units to inspect:",null,{"$f":"ROUND(IF('Property Info'!E16<20,3,IF('Property Info'!E16>600,30,IF('Property Info'!E16<56,5,IF('Property Info'!E16<100,'Property Info'!E16*0.1,IF('Property Info'!E16<201,10,'Property Info'!E16*0.05))))),0)","v":10},null,null,null,null,null,null,null,"Helper for compliance counts","Helper for unit counts","This is a water fixture","Number spec","Bath compliance","Kitchen compliance","EWEM number","EWEM description"]
[null,"Number of units inspected so far:",null,{"$f":"ROUND(SUMPRODUCT(1/COUNTIF(M7:M506,M7:M506&\"\"))-1,0)","v":0}]
[null,"Unit # or Space name","Space Type","EWEM","Nameplate Number Value","Fixture Compliance","Compliant or Noncompliant?","Supporting comments for this observation"]
[null,null,{"$f":"IF(B7=\"\",\"\",INDEX('Units and Spaces'!C:C,MATCH(Observations!B7,'Units and Spaces'!B:B,0)))","v":""},null,null,{"$f":"IF(AND(N7=TRUE,E7<>\"\"), IF(ISNUMBER(SEARCH(\"compliant\", P7)),P7,IF(ISNUMBER(SEARCH(\"compliant\",Q7)),Q7,IF(E7<=O7,\"compliant\",\"noncompliant\"))),\"\")","v":""},null,null,null,null,null,{"$f":"IF(OR(F7=\"compliant\",F7=\"noncompliant\"),D7&F7,D7&G7)","v":""},{"$f":"IF(C7=\"Apartment\",IF(B7=0,\"\",B7),\"\")","v":""},{"$f":"IF(OR(ISNUMBER(FIND(\"low-flow\",D7,1)), ISNUMBER(FIND(\"low-flush\",D7,1))),TRUE,FALSE)","v":false},{"$f":"INDEX(EWEMs!$E$5:$E$24,MATCH(D7,EWEMs!$W$5:$W$24,0))","v":{"$error":"#N/A"}},{"$f":"IF(OR(ISNUMBER(SEARCH(\"bath faucets\", D7)), AND( ISNUMBER(SEARCH(\"fixture\", D7)),ISNUMBER(SEARCH(\"bath\", S7)) )), IF(O7<=1, IF(AND(E7>=O7, E7<=1), \"compliant\", \"noncompliant\"), IF(AND(E7>=1, E7<=O7),\"compliant\",\"noncompliant\")), \"not bath\"\n)","v":"not bath"},{"$f":"IF(OR(ISNUMBER(SEARCH(\"kitchen faucets\", D7)), AND(ISNUMBER(SEARCH(\"fixtures\", D7)),ISNUMBER(SEARCH(\"kitchen\", S7)) )), IF(O7<=1.5, IF(AND(E7>=O7, E7<=1.5), \"compliant\", \"noncompliant\"), IF(AND(E7>=1.5, E7<=O7),\"compliant\",\"noncompliant\")), \"not kitchen\"\n)","v":"not kitchen"},{"$f":"LEFT(D7,(FIND(\" \",D7,1)-1))*1","v":{"$error":"#VALUE!"}},{"$f":"VLOOKUP(Observations!R7,EWEMs!$B$5:$D$24,3,FALSE)","v":{"$error":"#VALUE!"}}]
[null,null,{"$f":"IF(B8=\"\",\"\",INDEX('Units and Spaces'!C:C,MATCH(Observations!B8,'Units and Spaces'!B:B,0)))","v":""},null,null,{"$f":"IF(AND(N8=TRUE,E8<>\"\"), IF(ISNUMBER(SEARCH(\"compliant\", P8)),P8,IF(ISNUMBER(SEARCH(\"compliant\",Q8)),Q8,IF(E8<=O8,\"compliant\",\"noncompliant\"))),\"\")","v":""},null,null,null,null,null,{"$f":"IF(OR(F8=\"compliant\",F8=\"noncompliant\"),D8&F8,D8&G8)","v":""},{"$f":"IF(C8=\"Apartment\",IF(B8=0,\"\",B8),\"\")","v":""},{"$f":"IF(OR(ISNUMBER(FIND(\"low-flow\",D8,1)), ISNUMBER(FIND(\"low-flush\",D8,1))),TRUE,FALSE)","v":false},{"$f":"INDEX(EWEMs!$E$5:$E$24,MATCH(D8,EWEMs!$W$5:$W$24,0))","v":{"$error":"#N/A"}},{"$f":"IF(OR(ISNUMBER(SEARCH(\"bath faucets\", D8)), AND( ISNUMBER(SEARCH(\"fixture\", D8)),ISNUMBER(SEARCH(\"bath\", S8)) )), IF(O8<=1, IF(AND(E8>=O8, E8<=1), \"compliant\", \"noncompliant\"), IF(AND(E8>=1, E8<=O8),\"compliant\",\"noncompliant\")), \"not bath\"\n)","v":"not bath"},{"$f":"IF(OR(ISNUMBER(SEARCH(\"kitchen faucets\", D8)), AND(ISNUMBER(SEARCH(\"fixtures\", D8)),ISNUMBER(SEARCH(\"kitchen\", S8)) )), IF(O8<=1.5, IF(AND(E8>=O8, E8<=1.5), \"compliant\", \"noncompliant\"), IF(AND(E8>=1.5, E8<=O8),\"compliant\",\"noncompliant\")), \"not kitchen\"\n)","v":"not kitchen"},{"$f":"LEFT(D8,(FIND(\" \",D8,1)-1))*1","v":{"$error":"#VALUE!"}},{"$f":"VLOOKUP(Observations!R8,EWEMs!$B$5:$D$24,3,FALSE)","v":{"$error":"#VALUE!"}}]
[null,null,{"$f":"IF(B9=\"\",\"\",INDEX('Units and Spaces'!C:C,MATCH(Observations!B9,'Units and Spaces'!B:B,0)))","v":""},null,null,"",null,null,null,null,null,"","",false,{"$f":"INDEX(EWEMs!$E$5:$E$24,MATCH(D9,EWEMs!$W$5:$W$24,0))","v":{"$error":"#N/A"}},"not bath","not kitchen",{"$error":"#VALUE!"},{"$f":"VLOOKUP(Observations!R9,EWEMs!$B$5:$D$24,3,FALSE)","v":{"$error":"#VALUE!"}}]
[null,null,{"$f":"IF(B10=\"\",\"\",INDEX('Units and Spaces'!C:C,MATCH(Observations!B10,'Units and Spaces'!B:B,0)))","v":""},null,null,"",null,null,null,null,null,"","",false,{"$f":"INDEX(EWEMs!$E$5:$E$24,MATCH(D10,EWEMs!$W$5:$W$24,0))","v":{"$error":"#N/A"}},"not bath","not kitchen",{"$error":"#VALUE!"},{"$f":"VLOOKUP(Observations!R10,EWEMs!$B$5:$D$24,3,FALSE)","v":{"$error":"#VALUE!"}}]
[null,null,{"$f":"IF(B11=\"\",\"\",INDEX('Units and Spaces'!C:C,MATCH(Observations!B11,'Units and Spaces'!B:B,0)))","v":""},null,null,"",null,null,null,null,null,"","",false,{"$f":"INDEX(EWEMs!$E$5:$E$24,MATCH(D11,EWEMs!$W$5:$W$24,0))","v":{"$error":"#N/A"}},"not bath","not kitchen",{"$error":"#VALUE!"},{"$f":"VLOOKUP(Observations!R11,EWEMs!$B$5:$D$24,3,FALSE)","v":{"$error":"#VALUE!"}}]
[null,null,{"$f":"IF(B12=\"\",\"\",INDEX('Units and Spaces'!C:C,MATCH(Observations!B12,'Units and Spaces'!B:B,0)))","v":""},null,null,"",null,null,null,null,null,"","",false,{"$f":"INDEX(EWEMs!$E$5:$E$24,MATCH(D12,EWEMs!$W$5:$W$24,0))","v":{"$error":"#N/A"}},"not bath","not kitchen",{"$error":"#VALUE!"},{"$f":"VLOOKUP(Observations!R12,EWEMs!$B$5:$D$24,3,FALSE)","v":{"$error":"#VALUE!"}}]
[null,null,{"$f":"IF(B13=\"\",\"\",INDEX('Units and Spaces'!C:C,MATCH(Observations!B13,'Units and Spaces'!B:B,0)))","v":""},null,null,"",null,null,null,null,null,"","",false,{"$f":"INDEX(EWEMs!$E$5:$E$24,MATCH(D13,EWEMs!$W$5:$W$24,0))","v":{"$error":"#N/A"}},"not bath","not kitchen",{"$error":"#VALUE!"},{"$f":"VLOOKUP(Observations!R13,EWEMs!$B$5:$D$24,3,FALSE)","v":{"$error":"#VALUE!"}}]
[null,null,{"$f":"IF(B14=\"\",\"\",INDEX('Units and Spaces'!C:C,MATCH(Observations!B14,'Units and Spaces'!B:B,0)))","v":""},null,null,"",null,null,null,null,null,"","",false,{"$f":"INDEX(EWEMs!$E$5:$E$24,MATCH(D14,EWEMs!$W$5:$W$24,0))","v":{"$error":"#N/A"}},"not bath","not kitchen",{"$error":"#VALUE!"},{"$f":"VLOOKUP(Observations!R14,EWEMs!$B$5:$D$24,3,FALSE)","v":{"$error":"#VALUE!"}}]
[null,null,{"$f":"IF(B15=\"\",\"\",INDEX('Units and Spaces'!C:C,MATCH(Observations!B15,'Units and Spaces'!B:B,0)))","v":""},null,null,"",null,null,null,null,null,"","",false,{"$f":"INDEX(EWEMs!$E$5:$E$24,MATCH(D15,EWEMs!$W$5:$W$24,0))","v":{"$error":"#N/A"}},"not bath","not kitchen",{"$error":"#VALUE!"},{"$f":"VLOOKUP(Observations!R15,EWEMs!$B$5:$D$24,3,FALSE)","v":{"$error":"#VALUE!"}}]
[null,null,{"$f":"IF(B16=\"\",\"\",INDEX('Units and Spaces'!C:C,MATCH(Observations!B16,'Units and Spaces'!B:B,0)))","v":""},null,null,"",null,null,null,null,null,"","",false,{"$f":"INDEX(EWEMs!$E$5:$E$24,MATCH(D16,EWEMs!$W$5:$W$24,0))","v":{"$error":"#N/A"}},"not bath","not kitchen",{"$error":"#VALUE!"},{"$f":"VLOOKUP(Observations!R16,EWEMs!$B$5:$D$24,3,FALSE)","v":{"$error":"#VALUE!"}}]
[null,null,{"$f":"IF(B17=\"\",\"\",INDEX('Units and Spaces'!C:C,MATCH(Observations!B17,'Units and Spaces'!B:B,0)))","v":""},null,null,"",null,null,null,null,null,"","",false,{"$f":"INDEX(EWEMs!$E$5:$E$24,MATCH(D17,EWEMs!$W$5:$W$24,0))","v":{"$error":"#N/A"}},"not bath","not kitchen",{"$error":"#VALUE!"},{"$f":"VLOOKUP(Observations!R17,EWEMs!$B$5:$D$24,3,FALSE)","v":{"$error":"#VALUE!"}}]
[null,null,{"$f":"IF(B18=\"\",\"\",INDEX('Units and Spaces'!C:C,MATCH(Observations!B18,'Units and Spaces'!B:B,0)))","v":""},null,null,"",null,null,null,null,null,"","",false,{"$f":"INDEX(EWEMs!$E$5:$E$24,MATCH(D18,EWEMs!$W$5:$W$24,0))","v":{"$error":"#N/A"}},"not bath","not kitchen",{"$error":"#VALUE!"},{"$f":"VLOOKUP(Observations!R18,EWEMs!$B$5:$D$24,3,FALSE)","v":{"$error":"#VALUE!"}}]
[null,null,{"$f":"IF(B19=\"\",\"\",INDEX('Units and Spaces'!C:C,MATCH(Observations!B19,'Units and Spaces'!B:B,0)))","v":""},null,null,"",null,null,null,null,null,"","",false,{"$f":"INDEX(EWEMs!$E$5:$E$24,MATCH(D19,EWEMs!$W$5:$W$24,0))","v":{"$error":"#N/A"}},"not bath","not kitchen",{"$error":"#VALUE!"},{"$f":"VLOOKUP(Observations!R19,EWEMs!$B$5:$D$24,3,FALSE)","v":{"$error":"#VALUE!"}}]
[null,null,{"$f":"IF(B20=\"\",\"\",INDEX('Units and Spaces'!C:C,MATCH(Observations!B20,'Units and Spaces'!B:B,0)))","v":""},null,null,"",null,null,null,null,null,"","",false,{"$f":"INDEX(EWEMs!$E$5:$E$24,MATCH(D20,EWEMs!$W$5:$W$24,0))","v":{"$error":"#N/A"}},"not bath","not kitchen",{"$error":"#VALUE!"},{"$f":"VLOOKUP(Observations!R20,EWEMs!$B$5:$D$24,3,FALSE)","v":{"$error":"#VALUE!"}}]
[null,null,{"$f":"IF(B21=\"\",\"\",INDEX('Units and Spaces'!C:C,MATCH(Observations!B21,'Units and Spaces'!B:B,0)))","v":""},null,null,"",null,null,null,null,null,"","",false,{"$f":"INDEX(EWEMs!$E$5:$E$24,MATCH(D21,EWEMs!$W$5:$W$24,0))","v":{"$error":"#N/A"}},"not bath","not kitchen",{"$error":"#VALUE!"},{"$f":"VLOOKUP(Observations!R21,EWEMs!$B$5:$D$24,3,FALSE)","v":{"$error":"#VALUE!"}}]
[null,null,{"$f":"IF(B22=\"\",\"\",INDEX('Units and Spaces'!C:C,MATCH(Observations!B22,'Units and Spaces'!B:B,0)))","v":""},null,null,"",null,null,null,null,null,"","",false,{"$f":"INDEX(EWEMs!$E$5:$E$24,MATCH(D22,EWEMs!$W$5:$W$24,0))","v":{"$error":"#N/A"}},"not bath","not kitchen",{"$error":"#VALUE!"},{"$f":"VLOOKUP(Observations!R22,EWEMs!$B$5:$D$24,3,FALSE)","v":{"$error":"#VALUE!"}}]
[null,null,{"$f":"IF(B23=\"\",\"\",INDEX('Units and Spaces'!C:C,MATCH(Observations!B23,'Units and Spaces'!B:B,0)))","v":""},null,null,"",null,null,null,null,null,"","",false,{"$f":"INDEX(EWEMs!$E$5:$E$24,MATCH(D23,EWEMs!$W$5:$W$24,0))","v":{"$error":"#N/A"}},"not bath","not kitchen",{"$error":"#VALUE!"},{"$f":"VLOOKUP(Observations!R23,EWEMs!$B$5:$D$24,3,FALSE)","v":{"$error":"#VALUE!"}}]
[null,null,{"$f":"IF(B24=\"\",\"\",INDEX('Units and Spaces'!C:C,MATCH(Observations!B24,'Units and Spaces'!B:B,0)))","v":""},null,null,"",null,null,null,null,null,"","",false,{"$f":"INDEX(EWEMs!$E$5:$E$24,MATCH(D24,EWEMs!$W$5:$W$24,0))","v":{"$error":"#N/A"}},"not bath","not kitchen",{"$error":"#VALUE!"},{"$f":"VLOOKUP(Observations!R24,EWEMs!$B$5:$D$24,3,FALSE)","v":{"$error":"#VALUE!"}}]
[null,null,{"$f":"IF(B25=\"\",\"\",INDEX('Units and Spaces'!C:C,MATCH(Observations!B25,'Units and Spaces'!B:B,0)))","v":""},null,null,"",null,null,null,null,null,"","",false,{"$f":"INDEX(EWEMs!$E$5:$E$24,MATCH(D25,EWEMs!$W$5:$W$24,0))","v":{"$error":"#N/A"}},"not bath","not kitchen",{"$error":"#VALUE!"},{"$f":"VLOOKUP(Observations!R25,EWEMs!$B$5:$D$24,3,FALSE)","v":{"$error":"#VALUE!"}}]
[null,null,{"$f":"IF(B26=\"\",\"\",INDEX('Units and Spaces'!C:C,MATCH(Observations!B26,'Units and Spaces'!B:B,0)))","v":""},null,null,"",null,null,null,null,null,"","",false,{"$f":"INDEX(EWEMs!$E$5:$E$24,MATCH(D26,EWEMs!$W$5:$W$24,0))","v":{"$error":"#N/A"}},"not bath","not kitchen",{"$error":"#VALUE!"},{"$f":"VLOOKUP(Observations!R26,EWEMs!$B$5:$D$24,3,FALSE)","v":{"$error":"#VALUE!"}}]
[null,null,{"$f":"IF(B27=\"\",\"\",INDEX('Units and Spaces'!C:C,MATCH(Observations!B27,'Units and Spaces'!B:B,0)))","v":""},null,null,"",null,null,null,null,null,"","",false,{"$f":"INDEX(EWEMs!$E$5:$E$24,MATCH(D27,EWEMs!$W$5:$W$24,0))","v":{"$error":"#N/A"}},"not bath","not kitchen",{"$error":"#VALUE!"},{"$f":"VLOOKUP(Observations!R27,EWEMs!$B$5:$D$24,3,FALSE)","v":{"$error":"#VALUE!"}}]
[null,null,{"$f":"IF(B28=\"\",\"\",INDEX('Units and Spaces'!C:C,MATCH(Observations!B28,'Units and Spaces'!B:B,0)))","v":""},null,null,"",null,null,null,null,null,"","",false,{"$f":"INDEX(EWEMs!$E$5:$E$24,MATCH(D28,EWEMs!$W$5:$W$24,0))","v":{"$error":"#N/A"}},"not bath","not kitchen",{"$error":"#VALUE!"},{"$f":"VLOOKUP(Observations!R28,EWEMs!$B$5:$D$24,3,FALSE)","v":{"$error":"#VALUE!"}}]
[null,null,{"$f":"IF(B29=\"\",\"\",INDEX('Units and Spaces'!C:C,MATCH(Observations!B29,'Units and Spaces'!B:B,0)))","v":""},null,null,"",null,null,null,null,null,"","",false,{"$f":"INDEX(EWEMs!$E$5:$E$24,MATCH(D29,EWEMs!$W$5:$W$24,0))","v":{"$error":"#N/A"}},"not bath","not kitchen",{"$error":"#VALUE!"},{"$f":"VLOOKUP(Observations!R29,EWEMs!$B$5:$D$24,3,FALSE)","v":{"$error":"#VALUE!"}}]
[null,null,{"$f":"IF(B30=\"\",\"\",INDEX('Units and Spaces'!C:C,MATCH(Observations!B30,'Units and Spaces'!B:B,0)))","v":""},null,null,"",null,null,null,null,null,"","",false,{"$f":"INDEX(EWEMs!$E$5:$E$24,MATCH(D30,EWEMs!$W$5:$W$24,0))","v":{"$error":"#N/A"}},"not bath","not kitchen",{"$error":"#VALUE!"},{"$f":"VLOOKUP(Observations!R30,EWEMs!$B$5:$D$24,3,FALSE)","v":{"$error":"#VALUE!"}}]
[null,null,{"$f":"IF(B31=\"\",\"\",INDEX('Units and Spaces'!C:C,MATCH(Observations!B31,'Units and Spaces'!B:B,0)))","v":""},null,null,"",null,null,null,null,null,"","",false,{"$f":"INDEX(EWEMs!$E$5:$E$24,MATCH(D31,EWEMs!$W$5:$W$24,0))","v":{"$error":"#N/A"}},"not bath","not kitchen",{"$error":"#VALUE!"},{"$f":"VLOOKUP(Observations!R31,EWEMs!$B$5:$D$24,3,FALSE)","v":{"$error":"#VALUE!"}}]
[null,null,{"$f":"IF(B32=\"\",\"\",INDEX('Units and Spaces'!C:C,MATCH(Observations!B32,'Units and Spaces'!B:B,0)))","v":""},null,null,"",null,null,null,null,null,"","",false,{"$f":"INDEX(EWEMs!$E$5:$E$24,MATCH(D32,EWEMs!$W$5:$W$24,0))","v":{"$error":"#N/A"}},"not bath","not kitchen",{"$error":"#VALUE!"},{"$f":"VLOOKUP(Observations!R32,EWEMs!$B$5:$D$24,3,FALSE)","v":{"$error":"#VALUE!"}}]
[null,null,{"$f":"IF(B33=\"\",\"\",INDEX('Units and Spaces'!C:C,MATCH(Observations!B33,'Units and Spaces'!B:B,0)))","v":""},null,null,"",null,null,null,null,null,"","",false,{"$f":"INDEX(EWEMs!$E$5:$E$24,MATCH(D33,EWEMs!$W$5:$W$24,0))","v":{"$error":"#N/A"}},"not bath","not kitchen",{"$error":"#VALUE!"},{"$f":"VLOOKUP(Observations!R33,EWEMs!$B$5:$D$24,3,FALSE)","v":{"$error":"#VALUE!"}}]
[null,null,{"$f":"IF(B34=\"\",\"\",INDEX('Units and Spaces'!C:C,MATCH(Observations!B34,'Units and Spaces'!B:B,0)))","v":""},null,null,"",null,null,null,null,null,"","",false,{"$f":"INDEX(EWEMs!$E$5:$E$24,MATCH(D34,EWEMs!$W$5:$W$24,0))","v":{"$error":"#N/A"}},"not bath","not kitchen",{"$error":"#VALUE!"},{"$f":"VLOOKUP(Observations!R34,EWEMs!$B$5:$D$24,3,FALSE)","v":{"$error":"#VALUE!"}}]
[null,null,{"$f":"IF(B35=\"\",\"\",INDEX('Units and Spaces'!C:C,MATCH(Observations!B35,'Units and Spaces'!B:B,0)))","v":""},null,null,"",null,null,null,null,null,"","",false,{"$f":"INDEX(EWEMs!$E$5:$E$24,MATCH(D35,EWEMs!$W$5:$W$24,0))","v":{"$error":"#N/A"}},"not bath","not kitchen",{"$error":"#VALUE!"},{"$f":"VLOOKUP(Observations!R35,EWEMs!$B$5:$D$24,3,FALSE)","v":{"$error":"#VALUE!"}}]
[null,null,{"$f":"IF(B36=\"\",\"\",INDEX('Units and Spaces'!C:C,MATCH(Observations!B36,'Units and Spaces'!B:B,0)))","v":""},null,null,"",null,null,null,null,null,"","",false,{"$f":"INDEX(EWEMs!$E$5:$E$24,MATCH(D36,EWEMs!$W$5:$W$24,0))","v":{"$error":"#N/A"}},"not bath","not kitchen",{"$error":"#VALUE!"},{"$f":"VLOOKUP(Observations!R36,EWEMs!$B$5:$D$24,3,FALSE)","v":{"$error":"#VALUE!"}}]
[null,null,{"$f":"IF(B37=\"\",\"\",INDEX('Units and Spaces'!C:C,MATCH(Observations!B37,'Units and Spaces'!B:B,0)))","v":""},null,null,"",null,null,null,null,null,"","",false,{"$f":"INDEX(EWEMs!$E$5:$E$24,MATCH(D37,EWEMs!$W$5:$W$24,0))","v":{"$error":"#N/A"}},"not bath","not kitchen",{"$error":"#VALUE!"},{"$f":"VLOOKUP(Observations!R37,EWEMs!$B$5:$D$24,3,FALSE)","v":{"$error":"#VALUE!"}}]
[null,null,{"$f":"IF(B38=\"\",\"\",INDEX('Units and Spaces'!C:C,MATCH(Observations!B38,'Units and Spaces'!B:B,0)))","v":""},null,null,"",null,null,null,null,null,"","",false,{"$f":"INDEX(EWEMs!$E$5:$E$24,MATCH(D38,EWEMs!$W$5:$W$24,0))","v":{"$error":"#N/A"}},"not bath","not kitchen",{"$error":"#VALUE!"},{"$f":"VLOOKUP(Observations!R38,EWEMs!$B$5:$D$24,3,FALSE)","v":{"$error":"#VALUE!"}}]
[null,null,{"$f":"IF(B39=\"\",\"\",INDEX('Units and Spaces'!C:C,MATCH(Observations!B39,'Units and Spaces'!B:B,0)))","v":""},null,null,"",null,null,null,null,null,"","",false,{"$f":"INDEX(EWEMs!$E$5:$E$24,MATCH(D39,EWEMs!$W$5:$W$24,0))","v":{"$error":"#N/A"}},"not bath","not kitchen",{"$error":"#VALUE!"},{"$f":"VLOOKUP(Observations!R39,EWEMs!$B$5:$D$24,3,FALSE)","v":{"$error":"#VALUE!"}}]
[null,null,{"$f":"IF(B40=\"\",\"\",INDEX('Units and Spaces'!C:C,MATCH(Observations!B40,'Units and Spaces'!B:B,0)))","v":""},null,null,"",null,null,null,null,null,"","",false,{"$f":"INDEX(EWEMs!$E$5:$E$24,MATCH(D40,EWEMs!$W$5:$W$24,0))","v":{"$error":"#N/A"}},"not bath","not kitchen",{"$error":"#VALUE!"},{"$f":"VLOOKUP(Observations!R40,EWEMs!$B$5:$D$24,3,FALSE)","v":{"$error":"#VALUE!"}}]
[null,null,{"$f":"IF(B41=\"\",\"\",INDEX('Units and Spaces'!C:C,MATCH(Observations!B41,'Units and Spaces'!B:B,0)))","v":""},null,null,"",null,null,null,null,null,"","",false,{"$f":"INDEX(EWEMs!$E$5:$E$24,MATCH(D41,EWEMs!$W$5:$W$24,0))","v":{"$error":"#N/A"}},"not bath","not kitchen",{"$error":"#VALUE!"},{"$f":"VLOOKUP(Observations!R41,EWEMs!$B$5:$D$24,3,FALSE)","v":{"$error":"#VALUE!"}}]
[null,null,{"$f":"IF(B42=\"\",\"\",INDEX('Units and Spaces'!C:C,MATCH(Observations!B42,'Units and Spaces'!B:B,0)))","v":""},null,null,"",null,null,null,null,null,"","",false,{"$f":"INDEX(EWEMs!$E$5:$E$24,MATCH(D42,EWEMs!$W$5:$W$24,0))","v":{"$error":"#N/A"}},"not bath","not kitchen",{"$error":"#VALUE!"},{"$f":"VLOOKUP(Observations!R42,EWEMs!$B$5:$D$24,3,FALSE)","v":{"$error":"#VALUE!"}}]
[null,null,{"$f":"IF(B43=\"\",\"\",INDEX('Units and Spaces'!C:C,MATCH(Observations!B43,'Units and Spaces'!B:B,0)))","v":""},null,null,"",null,null,null,null,null,"","",false,{"$f":"INDEX(EWEMs!$E$5:$E$24,MATCH(D43,EWEMs!$W$5:$W$24,0))","v":{"$error":"#N/A"}},"not bath","not kitchen",{"$error":"#VALUE!"},{"$f":"VLOOKUP(Observations!R43,EWEMs!$B$5:$D$24,3,FALSE)","v":{"$error":"#VALUE!"}}]
[null,null,{"$f":"IF(B44=\"\",\"\",INDEX('Units and Spaces'!C:C,MATCH(Observations!B44,'Units and Spaces'!B:B,0)))","v":""},null,null,"",null,null,null,null,null,"","",false,{"$f":"INDEX(EWEMs!$E$5:$E$24,MATCH(D44,EWEMs!$W$5:$W$24,0))","v":{"$error":"#N/A"}},"not bath","not kitchen",{"$error":"#VALUE!"},{"$f":"VLOOKUP(Observations!R44,EWEMs!$B$5:$D$24,3,FALSE)","v":{"$error":"#VALUE!"}}]
[null,null,{"$f":"IF(B45=\"\",\"\",INDEX('Units and Spaces'!C:C,MATCH(Observations!B45,'Units and Spaces'!B:B,0)))","v":""},null,null,"",null,null,null,null,null,"","",false,{"$f":"INDEX(EWEMs!$E$5:$E$24,MATCH(D45,EWEMs!$W$5:$W$24,0))","v":{"$error":"#N/A"}},"not bath","not kitchen",{"$error":"#VALUE!"},{"$f":"VLOOKUP(Observations!R45,EWEMs!$B$5:$D$24,3,FALSE)","v":{"$error":"#VALUE!"}}]
[null,null,{"$f":"IF(B46=\"\",\"\",INDEX('Units and Spaces'!C:C,MATCH(Observations!B46,'Units and Spaces'!B:B,0)))","v":""},null,null,"",null,null,null,null,null,"","",false,{"$f":"INDEX(EWEMs!$E$5:$E$24,MATCH(D46,EWEMs!$W$5:$W$24,0))","v":{"$error":"#N/A"}},"not bath","not kitchen",{"$error":"#VALUE!"},{"$f":"VLOOKUP(Observations!R46,EWEMs!$B$5:$D$24,3,FALSE)","v":{"$error":"#VALUE!"}}]
[null,null,{"$f":"IF(B47=\"\",\"\",INDEX('Units and Spaces'!C:C,MATCH(Observations!B47,'Units and Spaces'!B:B,0)))","v":""},null,null,"",null,null,null,null,null,"","",false,{"$f":"INDEX(EWEMs!$E$5:$E$24,MATCH(D47,EWEMs!$W$5:$W$24,0))","v":{"$error":"#N/A"}},"not bath","not kitchen",{"$error":"#VALUE!"},{"$f":"VLOOKUP(Observations!R47,EWEMs!$B$5:$D$24,3,FALSE)","v":{"$error":"#VALUE!"}}]
[null,null,{"$f":"IF(B48=\"\",\"\",INDEX('Units and Spaces'!C:C,MATCH(Observations!B48,'Units and Spaces'!B:B,0)))","v":""},null,null,"",null,null,null,null,null,"","",false,{"$f":"INDEX(EWEMs!$E$5:$E$24,MATCH(D48,EWEMs!$W$5:$W$24,0))","v":{"$error":"#N/A"}},"not bath","not kitchen",{"$error":"#VALUE!"},{"$f":"VLOOKUP(Observations!R48,EWEMs!$B$5:$D$24,3,FALSE)","v":{"$error":"#VALUE!"}}]
[null,null,{"$f":"IF(B49=\"\",\"\",INDEX('Units and Spaces'!C:C,MATCH(Observations!B49,'Units and Spaces'!B:B,0)))","v":""},null,null,"",null,null,null,null,null,"","",false,{"$f":"INDEX(EWEMs!$E$5:$E$24,MATCH(D49,EWEMs!$W$5:$W$24,0))","v":{"$error":"#N/A"}},"not bath","not kitchen",{"$error":"#VALUE!"},{"$f":"VLOOKUP(Observations!R49,EWEMs!$B$5:$D$24,3,FALSE)","v":{"$error":"#VALUE!"}}]
[null,null,{"$f":"IF(B50=\"\",\"\",INDEX('Units and Spaces'!C:C,MATCH(Observations!B50,'Units and Spaces'!B:B,0)))","v":""},null,null,"",null,null,null,null,null,"","",false,{"$f":"INDEX(EWEMs!$E$5:$E$24,MATCH(D50,EWEMs!$W$5:$W$24,0))","v":{"$error":"#N/A"}},"not bath","not kitchen",{"$error":"#VALUE!"},{"$f":"VLOOKUP(Observations!R50,EWEMs!$B$5:$D$24,3,FALSE)","v":{"$error":"#VALUE!"}}]
[null,null,{"$f":"IF(B51=\"\",\"\",INDEX('Units and Spaces'!C:C,MATCH(Observations!B51,'Units and Spaces'!B:B,0)))","v":""},null,null,"",null,null,null,null,null,"","",false,{"$f":"INDEX(EWEMs!$E$5:$E$24,MATCH(D51,EWEMs!$W$5:$W$24,0))","v":{"$error":"#N/A"}},"not bath","not kitchen",{"$error":"#VALUE!"},{"$f":"VLOOKUP(Observations!R51,EWEMs!$B$5:$D$24,3,FALSE)","v":{"$error":"#VALUE!"}}]
[null,null,{"$f":"IF(B52=\"\",\"\",INDEX('Units and Spaces'!C:C,MATCH(Observations!B52,'Units and Spaces'!B:B,0)))","v":""},null,null,"",null,null,null,null,null,"","",false,{"$f":"INDEX(EWEMs!$E$5:$E$24,MATCH(D52,EWEMs!$W$5:$W$24,0))","v":{"$error":"#N/A"}},"not bath","not kitchen",{"$error":"#VALUE!"},{"$f":"VLOOKUP(Observations!R52,EWEMs!$B$5:$D$24,3,FALSE)","v":{"$error":"#VALUE!"}}]
[null,null,{"$f":"IF(B53=\"\",\"\",INDEX('Units and Spaces'!C:C,MATCH(Observations!B53,'Units and Spaces'!B:B,0)))","v":""},null,null,"",null,null,null,null,null,"","",false,{"$f":"INDEX(EWEMs!$E$5:$E$24,MATCH(D53,EWEMs!$W$5:$W$24,0))","v":{"$error":"#N/A"}},"not bath","not kitchen",{"$error":"#VALUE!"},{"$f":"VLOOKUP(Observations!R53,EWEMs!$B$5:$D$24,3,FALSE)","v":{"$error":"#VALUE!"}}]
[null,null,{"$f":"IF(B54=\"\",\"\",INDEX('Units and Spaces'!C:C,MATCH(Observations!B54,'Units and Spaces'!B:B,0)))","v":""},null,null,"",null,null,null,null,null,"","",false,{"$f":"INDEX(EWEMs!$E$5:$E$24,MATCH(D54,EWEMs!$W$5:$W$24,0))","v":{"$error":"#N/A"}},"not bath","not kitchen",{"$error":"#VALUE!"},{"$f":"VLOOKUP(Observations!R54,EWEMs!$B$5:$D$24,3,FALSE)","v":{"$error":"#VALUE!"}}]
[null,null,{"$f":"IF(B55=\"\",\"\",INDEX('Units and Spaces'!C:C,MATCH(Observations!B55,'Units and Spaces'!B:B,0)))","v":""},null,null,"",null,null,null,null,null,"","",false,{"$f":"INDEX(EWEMs!$E$5:$E$24,MATCH(D55,EWEMs!$W$5:$W$24,0))","v":{"$error":"#N/A"}},"not bath","not kitchen",{"$error":"#VALUE!"},{"$f":"VLOOKUP(Observations!R55,EWEMs!$B$5:$D$24,3,FALSE)","v":{"$error":"#VALUE!"}}]
[null,null,{"$f":"IF(B56=\"\",\"\",INDEX('Units and Spaces'!C:C,MATCH(Observations!B56,'Units and Spaces'!B:B,0)))","v":""},null,null,"",null,null,null,null,null,"","",false,{"$f":"INDEX(EWEMs!$E$5:$E$24,MATCH(D56,EWEMs!$W$5:$W$24,0))","v":{"$error":"#N/A"}},"not bath","not kitchen",{"$error":"#VALUE!"},{"$f":"VLOOKUP(Observations!R56,EWEMs!$B$5:$D$24,3,FALSE)","v":{"$error":"#VALUE!"}}]
[null,null,{"$f":"IF(B57=\"\",\"\",INDEX('Units and Spaces'!C:C,MATCH(Observations!B57,'Units and Spaces'!B:B,0)))","v":""},null,null,"",null,null,null,null,null,"","",false,{"$f":"INDEX(EWEMs!$E$5:$E$24,MATCH(D57,EWEMs!$W$5:$W$24,0))","v":{"$error":"#N/A"}},"not bath","not kitchen",{"$error":"#VALUE!"},{"$f":"VLOOKUP(Observations!R57,EWEMs!$B$5:$D$24,3,FALSE)","v":{"$error":"#VALUE!"}}]
[null,null,{"$f":"IF(B58=\"\",\"\",INDEX('Units and Spaces'!C:C,MATCH(Observations!B58,'Units and Spaces'!B:B,0)))","v":""},null,null,"",null,null,null,null,null,"","",false,{"$f":"INDEX(EWEMs!$E$5:$E$24,MATCH(D58,EWEMs!$W$5:$W$24,0))","v":{"$error":"#N/A"}},"not bath","not kitchen",{"$error":"#VALUE!"},{"$f":"VLOOKUP(Observations!R58,EWEMs!$B$5:$D$24,3,FALSE)","v":{"$error":"#VALUE!"}}]
[null,null,{"$f":"IF(B59=\"\",\"\",INDEX('Units and Spaces'!C:C,MATCH(Observations!B59,'Units and Spaces'!B:B,0)))","v":""},null,null,"",null,null,null,null,null,"","",false,{"$f":"INDEX(EWEMs!$E$5:$E$24,MATCH(D59,EWEMs!$W$5:$W$24,0))","v":{"$error":"#N/A"}},"not bath","not kitchen",{"$error":"#VALUE!"},{"$f":"VLOOKUP(Observations!R59,EWEMs!$B$5:$D$24,3,FALSE)","v":{"$error":"#VALUE!"}}]
[null,null,{"$f":"IF(B60=\"\",\"\",INDEX('Units and Spaces'!C:C,MATCH(Observations!B60,'Units and Spaces'!B:B,0)))","v":""},null,null,"",null,null,null,null,null,"","",false,{"$f":"INDEX(EWEMs!$E$5:$E$24,MATCH(D60,EWEMs!$W$5:$W$24,0))","v":{"$error":"#N/A"}},"not bath","not kitchen",{"$error":"#VALUE!"},{"$f":"VLOOKUP(Observations!R60,EWEMs!$B$5:$D$24,3,FALSE)","v":{"$error":"#VALUE!"}}]
[null,null,{"$f":"IF(B61=\"\",\"\",INDEX('Units and Spaces'!C:C,MATCH(Observations!B61,'Units and Spaces'!B:B,0)))","v":""},null,null,"",null,null,null,null,null,"","",false,{"$f":"INDEX(EWEMs!$E$5:$E$24,MATCH(D61,EWEMs!$W$5:$W$24,0))","v":{"$error":"#N/A"}},"not bath","not kitchen",{"$error":"#VALUE!"},{"$f":"VLOOKUP(Observations!R61,EWEMs!$B$5:$D$24,3,FALSE)","v":{"$error":"#VALUE!"}}]
[null,null,{"$f":"IF(B62=\"\",\"\",INDEX('Units and Spaces'!C:C,MATCH(Observations!B62,'Units and Spaces'!B:B,0)))","v":""},null,null,"",null,null,null,null,null,"","",false,{"$f":"INDEX(EWEMs!$E$5:$E$24,MATCH(D62,EWEMs!$W$5:$W$24,0))","v":{"$error":"#N/A"}},"not bath","not kitchen",{"$error":"#VALUE!"},{"$f":"VLOOKUP(Observations!R62,EWEMs!$B$5:$D$24,3,FALSE)","v":{"$error":"#VALUE!"}}]
[null,null,{"$f":"IF(B63=\"\",\"\",INDEX('Units and Spaces'!C:C,MATCH(Observations!B63,'Units and Spaces'!B:B,0)))","v":""},null,null,"",null,null,null,null,null,"","",false,{"$f":"INDEX(EWEMs!$E$5:$E$24,MATCH(D63,EWEMs!$W$5:$W$24,0))","v":{"$error":"#N/A"}},"not bath","not kitchen",{"$error":"#VALUE!"},{"$f":"VLOOKUP(Observations!R63,EWEMs!$B$5:$D$24,3,FALSE)","v":{"$error":"#VALUE!"}}]
[null,null,{"$f":"IF(B64=\"\",\"\",INDEX('Units and Spaces'!C:C,MATCH(Observations!B64,'Units and Spaces'!B:B,0)))","v":""},null,null,"",null,null,null,null,null,"","",false,{"$f":"INDEX(EWEMs!$E$5:$E$24,MATCH(D64,EWEMs!$W$5:$W$24,0))","v":{"$error":"#N/A"}},"not bath","not kitchen",{"$error":"#VALUE!"},{"$f":"VLOOKUP(Observations!R64,EWEMs!$B$5:$D$24,3,FALSE)","v":{"$error":"#VALUE!"}}]
[null,null,{"$f":"IF(B65=\"\",\"\",INDEX('Units and Spaces'!C:C,MATCH(Observations!B65,'Units and Spaces'!B:B,0)))","v":""},null,null,"",null,null,null,null,null,"","",false,{"$f":"INDEX(EWEMs!$E$5:$E$24,MATCH(D65,EWEMs!$W$5:$W$24,0))","v":{"$error":"#N/A"}},"not bath","not kitchen",{"$error":"#VALUE!"},{"$f":"VLOOKUP(Observations!R65,EWEMs!$B$5:$D$24,3,FALSE)","v":{"$error":"#VALUE!"}}]
[null,null,{"$f":"IF(B66=\"\",\"\",INDEX('Units and Spaces'!C:C,MATCH(Observations!B66,'Units and Spaces'!B:B,0)))","v":""},null,null,"",null,null,null,null,null,"","",false,{"$f":"INDEX(EWEMs!$E$5:$E$24,MATCH(D66,EWEMs!$W$5:$W$24,0))","v":{"$error":"#N/A"}},"not bath","not kitchen",{"$error":"#VALUE!"},{"$f":"VLOOKUP(Observations!R66,EWEMs!$B$5:$D$24,3,FALSE)","v":{"$error":"#VALUE!"}}]
[null,null,{"$f":"IF(B67=\"\",\"\",INDEX('Units and Spaces'!C:C,MATCH(Observations!B67,'Units and Spaces'!B:B,0)))","v":""},null,null,"",null,null,null,null,null,"","",false,{"$f":"INDEX(EWEMs!$E$5:$E$24,MATCH(D67,EWEMs!$W$5:$W$24,0))","v":{"$error":"#N/A"}},"not bath","not kitchen",{"$error":"#VALUE!"},{"$f":"VLOOKUP(Observations!R67,EWEMs!$B$5:$D$24,3,FALSE)","v":{"$error":"#VALUE!"}}]
[null,null,{"$f":"IF(B68=\"\",\"\",INDEX('Units and Spaces'!C:C,MATCH(Observations!B68,'Units and Spaces'!B:B,0)))","v":""},null,null,"",null,null,null,null,null,"","",false,{"$f":"INDEX(EWEMs!$E$5:$E$24,MATCH(D68,EWEMs!$W$5:$W$24,0))","v":{"$error":"#N/A"}},"not bath","not kitchen",{"$error":"#VALUE!"},{"$f":"VLOOKUP(Observations!R68,EWEMs!$B$5:$D$24,3,FALSE)","v":{"$error":"#VALUE!"}}]
[null,null,{"$f":"IF(B69=\"\",\"\",INDEX('Units and Spaces'!C:C,MATCH(Observations!B69,'Units and Spaces'!B:B,0)))","v":""},null,null,"",null,null,null,null,null,"","",false,{"$f":"INDEX(EWEMs!$E$5:$E$24,MATCH(D69,EWEMs!$W$5:$W$24,0))","v":{"$error":"#N/A"}},"not bath","not kitchen",{"$error":"#VALUE!"},{"$f":"VLOOKUP(Observations!R69,EWEMs!$B$5:$D$24,3,FALSE)","v":{"$error":"#VALUE!"}}]
[null,null,{"$f":"IF(B70=\"\",\"\",INDEX('Units and Spaces'!C:C,MATCH(Observations!B70,'Units and Spaces'!B:B,0)))","v":""},null,null,"",null,null,null,null,null,"","",false,{"$f":"INDEX(EWEMs!$E$5:$E$24,MATCH(D70,EWEMs!$W$5:$W$24,0))","v":{"$error":"#N/A"}},"not bath","not kitchen",{"$error":"#VALUE!"},{"$f":"VLOOKUP(Observations!R70,EWEMs!$B$5:$D$24,3,FALSE)","v":{"$error":"#VALUE!"}}]
[null,null,{"$f":"IF(B71=\"\",\"\",INDEX('Units and Spaces'!C:C,MATCH(Observations!B71,'Units and Spaces'!B:B,0)))","v":""},null,null,"",null,null,null,null,null,"","",false,{"$f":"INDEX(EWEMs!$E$5:$E$24,MATCH(D71,EWEMs!$W$5:$W$24,0))","v":{"$error":"#N/A"}},"not bath","not kitchen",{"$error":"#VALUE!"},{"$f":"VLOOKUP(Observations!R71,EWEMs!$B$5:$D$24,3,FALSE)","v":{"$error":"#VALUE!"}}]
[null,null,{"$f":"IF(B72=\"\",\"\",INDEX('Units and Spaces'!C:C,MATCH(Observations!B72,'Units and Spaces'!B:B,0)))","v":""},null,null,{"$f":"IF(AND(N72=TRUE,E72<>\"\"), IF(ISNUMBER(SEARCH(\"compliant\", P72)),P72,IF(ISNUMBER(SEARCH(\"compliant\",Q72)),Q72,IF(E72<=O72,\"compliant\",\"noncompliant\"))),\"\")","v":""},null,null,null,null,null,{"$f":"IF(OR(F72=\"compliant\",F72=\"noncompliant\"),D72&F72,D72&G72)","v":""},{"$f":"IF(C72=\"Apartment\",IF(B72=0,\"\",B72),\"\")","v":""},{"$f":"IF(OR(ISNUMBER(FIND(\"low-flow\",D72,1)), ISNUMBER(FIND(\"low-flush\",D72,1))),TRUE,FALSE)","v":false},{"$f":"INDEX(EWEMs!$E$5:$E$24,MATCH(D72,EWEMs!$W$5:$W$24,0))","v":{"$error":"#N/A"}},{"$f":"IF(OR(ISNUMBER(SEARCH(\"bath faucets\", D72)), AND( ISNUMBER(SEARCH(\"fixture\", D72)),ISNUMBER(SEARCH(\"bath\", S72)) )), IF(O72<=1, IF(AND(E72>=O72, E72<=1), \"compliant\", \"noncompliant\"), IF(AND(E72>=1, E72<=O72),\"compliant\",\"noncompliant\")), \"not bath\"\n)","v":"not bath"},{"$f":"IF(OR(ISNUMBER(SEARCH(\"kitchen faucets\", D72)), AND(ISNUMBER(SEARCH(\"fixtures\", D72)),ISNUMBER(SEARCH(\"kitchen\", S72)) )), IF(O72<=1.5, IF(AND(E72>=O72, E72<=1.5), \"compliant\", \"noncompliant\"), IF(AND(E72>=1.5, E72<=O72),\"compliant\",\"noncompliant\")), \"not kitchen\"\n)","v":"not kitchen"},{"$f":"LEFT(D72,(FIND(\" \",D72,1)-1))*1","v":{"$error":"#VALUE!"}},{"$f":"VLOOKUP(Observations!R72,EWEMs!$B$5:$D$24,3,FALSE)","v":{"$error":"#VALUE!"}}]
[null,null,{"$f":"IF(B73=\"\",\"\",INDEX('Units and Spaces'!C:C,MATCH(Observations!B73,'Units and Spaces'!B:B,0)))","v":""},null,null,"",null,null,null,null,null,"","",false,{"$f":"INDEX(EWEMs!$E$5:$E$24,MATCH(D73,EWEMs!$W$5:$W$24,0))","v":{"$error":"#N/A"}},"not bath","not kitchen",{"$error":"#VALUE!"},{"$f":"VLOOKUP(Observations!R73,EWEMs!$B$5:$D$24,3,FALSE)","v":{"$error":"#VALUE!"}}]
[null,null,{"$f":"IF(B74=\"\",\"\",INDEX('Units and Spaces'!C:C,MATCH(Observations!B74,'Units and Spaces'!B:B,0)))","v":""},null,null,"",null,null,null,null,null,"","",false,{"$f":"INDEX(EWEMs!$E$5:$E$24,MATCH(D74,EWEMs!$W$5:$W$24,0))","v":{"$error":"#N/A"}},"not bath","not kitchen",{"$error":"#VALUE!"},{"$f":"VLOOKUP(Observations!R74,EWEMs!$B$5:$D$24,3,FALSE)","v":{"$error":"#VALUE!"}}]
[null,null,{"$f":"IF(B75=\"\",\"\",INDEX('Units and Spaces'!C:C,MATCH(Observations!B75,'Units and Spaces'!B:B,0)))","v":""},null,null,"",null,null,null,null,null,"","",false,{"$f":"INDEX(EWEMs!$E$5:$E$24,MATCH(D75,EWEMs!$W$5:$W$24,0))","v":{"$error":"#N/A"}},"not bath","not kitchen",{"$error":"#VALUE!"},{"$f":"VLOOKUP(Observations!R75,EWEMs!$B$5:$D$24,3,FALSE)","v":{"$error":"#VALUE!"}}]
[null,null,{"$f":"IF(B76=\"\",\"\",INDEX('Units and Spaces'!C:C,MATCH(Observations!B76,'Units and Spaces'!B:B,0)))","v":""},null,null,"",null,null,null,null,null,"","",false,{"$f":"INDEX(EWEMs!$E$5:$E$24,MATCH(D76,EWEMs!$W$5:$W$24,0))","v":{"$error":"#N/A"}},"not bath","not kitchen",{"$error":"#VALUE!"},{"$f":"VLOOKUP(Observations!R76,EWEMs!$B$5:$D$24,3,FALSE)","v":{"$error":"#VALUE!"}}]
[null,null,{"$f":"IF(B77=\"\",\"\",INDEX('Units and Spaces'!C:C,MATCH(Observations!B77,'Units and Spaces'!B:B,0)))","v":""},null,null,"",null,null,null,null,null,"","",false,{"$f":"INDEX(EWEMs!$E$5:$E$24,MATCH(D77,EWEMs!$W$5:$W$24,0))","v":{"$error":"#N/A"}},"not bath","not kitchen",{"$error":"#VALUE!"},{"$f":"VLOOKUP(Observations!R77,EWEMs!$B$5:$D$24,3,FALSE)","v":{"$error":"#VALUE!"}}]
[null,null,{"$f":"IF(B78=\"\",\"\",INDEX('Units and Spaces'!C:C,MATCH(Observations!B78,'Units and Spaces'!B:B,0)))","v":""},null,null,"",null,null,null,null,null,"","",false,{"$f":"INDEX(EWEMs!$E$5:$E$24,MATCH(D78,EWEMs!$W$5:$W$24,0))","v":{"$error":"#N/A"}},"not bath","not kitchen",{"$error":"#VALUE!"},{"$f":"VLOOKUP(Observations!R78,EWEMs!$B$5:$D$24,3,FALSE)","v":{"$error":"#VALUE!"}}]
[null,null,{"$f":"IF(B79=\"\",\"\",INDEX('Units and Spaces'!C:C,MATCH(Observations!B79,'Units and Spaces'!B:B,0)))","v":""},null,null,"",null,null,null,null,null,"","",false,{"$f":"INDEX(EWEMs!$E$5:$E$24,MATCH(D79,EWEMs!$W$5:$W$24,0))","v":{"$error":"#N/A"}},"not bath","not kitchen",{"$error":"#VALUE!"},{"$f":"VLOOKUP(Observations!R79,EWEMs!$B$5:$D$24,3,FALSE)","v":{"$error":"#VALUE!"}}]
[null,null,{"$f":"IF(B80=\"\",\"\",INDEX('Units and Spaces'!C:C,MATCH(Observations!B80,'Units and Spaces'!B:B,0)))","v":""},null,null,"",null,null,null,null,null,"","",false,{"$f":"INDEX(EWEMs!$E$5:$E$24,MATCH(D80,EWEMs!$W$5:$W$24,0))","v":{"$error":"#N/A"}},"not bath","not kitchen",{"$error":"#VALUE!"},{"$f":"VLOOKUP(Observations!R80,EWEMs!$B$5:$D$24,3,FALSE)","v":{"$error":"#VALUE!"}}]
[null,null,{"$f":"IF(B81=\"\",\"\",INDEX('Units and Spaces'!C:C,MATCH(Observations!B81,'Units and Spaces'!B:B,0)))","v":""},null,null,"",null,null,null,null,null,"","",false,{"$f":"INDEX(EWEMs!$E$5:$E$24,MATCH(D81,EWEMs!$W$5:$W$24,0))","v":{"$error":"#N/A"}},"not bath","not kitchen",{"$error":"#VALUE!"},{"$f":"VLOOKUP(Observations!R81,EWEMs!$B$5:$D$24,3,FALSE)","v":{"$error":"#VALUE!"}}]
[null,null,{"$f":"IF(B82=\"\",\"\",INDEX('Units and Spaces'!C:C,MATCH(Observations!B82,'Units and Spaces'!B:B,0)))","v":""},null,null,"",null,null,null,null,null,"","",false,{"$f":"INDEX(EWEMs!$E$5:$E$24,MATCH(D82,EWEMs!$W$5:$W$24,0))","v":{"$error":"#N/A"}},"not bath","not kitchen",{"$error":"#VALUE!"},{"$f":"VLOOKUP(Observations!R82,EWEMs!$B$5:$D$24,3,FALSE)","v":{"$error":"#VALUE!"}}]
[null,null,{"$f":"IF(B83=\"\",\"\",INDEX('Units and Spaces'!C:C,MATCH(Observations!B83,'Units and Spaces'!B:B,0)))","v":""},null,null,"",null,null,null,null,null,"","",false,{"$f":"INDEX(EWEMs!$E$5:$E$24,MATCH(D83,EWEMs!$W$5:$W$24,0))","v":{"$error":"#N/A"}},"not bath","not kitchen",{"$error":"#VALUE!"},{"$f":"VLOOKUP(Observations!R83,EWEMs!$B$5:$D$24,3,FALSE)","v":{"$error":"#VALUE!"}}]
[null,null,{"$f":"IF(B84=\"\",\"\",INDEX('Units and Spaces'!C:C,MATCH(Observations!B84,'Units and Spaces'!B:B,0)))","v":""},null,null,"",null,null,null,null,null,"","",false,{"$f":"INDEX(EWEMs!$E$5:$E$24,MATCH(D84,EWEMs!$W$5:$W$24,0))","v":{"$error":"#N/A"}},"not bath","not kitchen",{"$error":"#VALUE!"},{"$f":"VLOOKUP(Observations!R84,EWEMs!$B$5:$D$24,3,FALSE)","v":{"$error":"#VALUE!"}}]
[null,null,{"$f":"IF(B85=\"\",\"\",INDEX('Units and Spaces'!C:C,MATCH(Observations!B85,'Units and Spaces'!B:B,0)))","v":""},null,null,"",null,null,null,null,null,"","",false,{"$f":"INDEX(EWEMs!$E$5:$E$24,MATCH(D85,EWEMs!$W$5:$W$24,0))","v":{"$error":"#N/A"}},"not bath","not kitchen",{"$error":"#VALUE!"},{"$f":"VLOOKUP(Observations!R85,EWEMs!$B$5:$D$24,3,FALSE)","v":{"$error":"#VALUE!"}}]
[null,null,{"$f":"IF(B86=\"\",\"\",INDEX('Units and Spaces'!C:C,MATCH(Observations!B86,'Units and Spaces'!B:B,0)))","v":""},null,null,"",null,null,null,null,null,"","",false,{"$f":"INDEX(EWEMs!$E$5:$E$24,MATCH(D86,EWEMs!$W$5:$W$24,0))","v":{"$error":"#N/A"}},"not bath","not kitchen",{"$error":"#VALUE!"},{"$f":"VLOOKUP(Observations!R86,EWEMs!$B$5:$D$24,3,FALSE)","v":{"$error":"#VALUE!"}}]
[null,null,{"$f":"IF(B87=\"\",\"\",INDEX('Units and Spaces'!C:C,MATCH(Observations!B87,'Units and Spaces'!B:B,0)))","v":""},null,null,"",null,null,null,null,null,"","",false,{"$f":"INDEX(EWEMs!$E$5:$E$24,MATCH(D87,EWEMs!$W$5:$W$24,0))","v":{"$error":"#N/A"}},"not bath","not kitchen",{"$error":"#VALUE!"},{"$f":"VLOOKUP(Observations!R87,EWEMs!$B$5:$D$24,3,FALSE)","v":{"$error":"#VALUE!"}}]
[null,null,{"$f":"IF(B88=\"\",\"\",INDEX('Units and Spaces'!C:C,MATCH(Observations!B88,'Units and Spaces'!B:B,0)))","v":""},null,null,"",null,null,null,null,null,"","",false,{"$f":"INDEX(EWEMs!$E$5:$E$24,MATCH(D88,EWEMs!$W$5:$W$24,0))","v":{"$error":"#N/A"}},"not bath","not kitchen",{"$error":"#VALUE!"},{"$f":"VLOOKUP(Observations!R88,EWEMs!$B$5:$D$24,3,FALSE)","v":{"$error":"#VALUE!"}}]
[null,null,{"$f":"IF(B89=\"\",\"\",INDEX('Units and Spaces'!C:C,MATCH(Observations!B89,'Units and Spaces'!B:B,0)))","v":""},null,null,"",null,null,null,null,null,"","",false,{"$f":"INDEX(EWEMs!$E$5:$E$24,MATCH(D89,EWEMs!$W$5:$W$24,0))","v":{"$error":"#N/A"}},"not bath","not kitchen",{"$error":"#VALUE!"},{"$f":"VLOOKUP(Observations!R89,EWEMs!$B$5:$D$24,3,FALSE)","v":{"$error":"#VALUE!"}}]
[null,null,{"$f":"IF(B90=\"\",\"\",INDEX('Units and Spaces'!C:C,MATCH(Observations!B90,'Units and Spaces'!B:B,0)))","v":""},null,null,"",null,null,null,null,null,"","",false,{"$f":"INDEX(EWEMs!$E$5:$E$24,MATCH(D90,EWEMs!$W$5:$W$24,0))","v":{"$error":"#N/A"}},"not bath","not kitchen",{"$error":"#VALUE!"},{"$f":"VLOOKUP(Observations!R90,EWEMs!$B$5:$D$24,3,FALSE)","v":{"$error":"#VALUE!"}}]
[null,null,{"$f":"IF(B91=\"\",\"\",INDEX('Units and Spaces'!C:C,MATCH(Observations!B91,'Units and Spaces'!B:B,0)))","v":""},null,null,"",null,null,null,null,null,"","",false,{"$f":"INDEX(EWEMs!$E$5:$E$24,MATCH(D91,EWEMs!$W$5:$W$24,0))","v":{"$error":"#N/A"}},"not bath","not kitchen",{"$error":"#VALUE!"},{"$f":"VLOOKUP(Observations!R91,EWEMs!$B$5:$D$24,3,FALSE)","v":{"$error":"#VALUE!"}}]
[null,null,{"$f":"IF(B92=\"\",\"\",INDEX('Units and Spaces'!C:C,MATCH(Observations!B92,'Units and Spaces'!B:B,0)))","v":""},null,null,"",null,null,null,null,null,"","",false,{"$f":"INDEX(EWEMs!$E$5:$E$24,MATCH(D92,EWEMs!$W$5:$W$24,0))","v":{"$error":"#N/A"}},"not bath","not kitchen",{"$error":"#VALUE!"},{"$f":"VLOOKUP(Observations!R92,EWEMs!$B$5:$D$24,3,FALSE)","v":{"$error":"#VALUE!"}}]
[null,null,{"$f":"IF(B93=\"\",\"\",INDEX('Units and Spaces'!C:C,MATCH(Observations!B93,'Units and Spaces'!B:B,0)))","v":""},null,null,"",null,null,null,null,null,"","",false,{"$f":"INDEX(EWEMs!$E$5:$E$24,MATCH(D93,EWEMs!$W$5:$W$24,0))","v":{"$error":"#N/A"}},"not bath","not kitchen",{"$error":"#VALUE!"},{"$f":"VLOOKUP(Observations!R93,EWEMs!$B$5:$D$24,3,FALSE)","v":{"$error":"#VALUE!"}}]
[null,null,{"$f":"IF(B94=\"\",\"\",INDEX('Units and Spaces'!C:C,MATCH(Observations!B94,'Units and Spaces'!B:B,0)))","v":""},null,null,"",null,null,null,null,null,"","",false,{"$f":"INDEX(EWEMs!$E$5:$E$24,MATCH(D94,EWEMs!$W$5:$W$24,0))","v":{"$error":"#N/A"}},"not bath","not kitchen",{"$error":"#VALUE!"},{"$f":"VLOOKUP(Observations!R94,EWEMs!$B$5:$D$24,3,FALSE)","v":{"$error":"#VALUE!"}}]
[null,null,{"$f":"IF(B95=\"\",\"\",INDEX('Units and Spaces'!C:C,MATCH(Observations!B95,'Units and Spaces'!B:B,0)))","v":""},null,null,"",null,null,null,null,null,"","",false,{"$f":"INDEX(EWEMs!$E$5:$E$24,MATCH(D95,EWEMs!$W$5:$W$24,0))","v":{"$error":"#N/A"}},"not bath","not kitchen",{"$error":"#VALUE!"},{"$f":"VLOOKUP(Observations!R95,EWEMs!$B$5:$D$24,3,FALSE)","v":{"$error":"#VALUE!"}}]
[null,null,{"$f":"IF(B96=\"\",\"\",INDEX('Units and Spaces'!C:C,MATCH(Observations!B96,'Units and Spaces'!B:B,0)))","v":""},null,null,"",null,null,null,null,null,"","",false,{"$f":"INDEX(EWEMs!$E$5:$E$24,MATCH(D96,EWEMs!$W$5:$W$24,0))","v":{"$error":"#N/A"}},"not bath","not kitchen",{"$error":"#VALUE!"},{"$f":"VLOOKUP(Observations!R96,EWEMs!$B$5:$D$24,3,FALSE)","v":{"$error":"#VALUE!"}}]
[null,null,{"$f":"IF(B97=\"\",\"\",INDEX('Units and Spaces'!C:C,MATCH(Observations!B97,'Units and Spaces'!B:B,0)))","v":""},null,null,"",null,null,null,null,null,"","",false,{"$f":"INDEX(EWEMs!$E$5:$E$24,MATCH(D97,EWEMs!$W$5:$W$24,0))","v":{"$error":"#N/A"}},"not bath","not kitchen",{"$error":"#VALUE!"},{"$f":"VLOOKUP(Observations!R97,EWEMs!$B$5:$D$24,3,FALSE)","v":{"$error":"#VALUE!"}}]
[null,null,{"$f":"IF(B98=\"\",\"\",INDEX('Units and Spaces'!C:C,MATCH(Observations!B98,'Units and Spaces'!B:B,0)))","v":""},null,null,"",null,null,null,null,null,"","",false,{"$f":"INDEX(EWEMs!$E$5:$E$24,MATCH(D98,EWEMs!$W$5:$W$24,0))","v":{"$error":"#N/A"}},"not bath","not kitchen",{"$error":"#VALUE!"},{"$f":"VLOOKUP(Observations!R98,EWEMs!$B$5:$D$24,3,FALSE)","v":{"$error":"#VALUE!"}}]
[null,null,{"$f":"IF(B99=\"\",\"\",INDEX('Units and Spaces'!C:C,MATCH(Observations!B99,'Units and Spaces'!B:B,0)))","v":""},null,null,"",null,null,null,null,null,"","",false,{"$f":"INDEX(EWEMs!$E$5:$E$24,MATCH(D99,EWEMs!$W$5:$W$24,0))","v":{"$error":"#N/A"}},"not bath","not kitchen",{"$error":"#VALUE!"},{"$f":"VLOOKUP(Observations!R99,EWEMs!$B$5:$D$24,3,FALSE)","v":{"$error":"#VALUE!"}}]
[null,null,{"$f":"IF(B100=\"\",\"\",INDEX('Units and Spaces'!C:C,MATCH(Observations!B100,'Units and Spaces'!B:B,0)))","v":""},null,null,"",null,null,null,null,null,"","",false,{"$f":"INDEX(EWEMs!$E$5:$E$24,MATCH(D100,EWEMs!$W$5:$W$24,0))","v":{"$error":"#N/A"}},"not bath","not kitchen",{"$error":"#VALUE!"},{"$f":"VLOOKUP(Observations!R100,EWEMs!$B$5:$D$24,3,FALSE)","v":{"$error":"#VALUE!"}}]
[null,null,{"$f":"IF(B101=\"\",\"\",INDEX('Units and Spaces'!C:C,MATCH(Observations!B101,'Units and Spaces'!B:B,0)))","v":""},null,null,"",null,null,null,null,null,"","",false,{"$f":"INDEX(EWEMs!$E$5:$E$24,MATCH(D101,EWEMs!$W$5:$W$24,0))","v":{"$error":"#N/A"}},"not bath","not kitchen",{"$error":"#VALUE!"},{"$f":"VLOOKUP(Observations!R101,EWEMs!$B$5:$D$24,3,FALSE)","v":{"$error":"#VALUE!"}}]
[null,null,{"$f":"IF(B102=\"\",\"\",INDEX('Units and Spaces'!C:C,MATCH(Observations!B102,'Units and Spaces'!B:B,0)))","v":""},null,null,"",null,null,null,null,null,"","",false,{"$f":"INDEX(EWEMs!$E$5:$E$24,MATCH(D102,EWEMs!$W$5:$W$24,0))","v":{"$error":"#N/A"}},"not bath","not kitchen",{"$error":"#VALUE!"},{"$f":"VLOOKUP(Observations!R102,EWEMs!$B$5:$D$24,3,FALSE)","v":{"$error":"#VALUE!"}}]
[null,null,{"$f":"IF(B103=\"\",\"\",INDEX('Units and Spaces'!C:C,MATCH(Observations!B103,'Units and Spaces'!B:B,0)))","v":""},null,null,"",null,null,null,null,null,"","",false,{"$f":"INDEX(EWEMs!$E$5:$E$24,MATCH(D103,EWEMs!$W$5:$W$24,0))","v":{"$error":"#N/A"}},"not bath","not kitchen",{"$error":"#VALUE!"},{"$f":"VLOOKUP(Observations!R103,EWEMs!$B$5:$D$24,3,FALSE)","v":{"$error":"#VALUE!"}}]
[null,null,{"$f":"IF(B104=\"\",\"\",INDEX('Units and Spaces'!C:C,MATCH(Observations!B104,'Units and Spaces'!B:B,0)))","v":""},null,null,"",null,null,null,null,null,"","",false,{"$f":"INDEX(EWEMs!$E$5:$E$24,MATCH(D104,EWEMs!$W$5:$W$24,0))","v":{"$error":"#N/A"}},"not bath","not kitchen",{"$error":"#VALUE!"},{"$f":"VLOOKUP(Observations!R104,EWEMs!$B$5:$D$24,3,FALSE)","v":{"$error":"#VALUE!"}}]
[null,null,{"$f":"IF(B105=\"\",\"\",INDEX('Units and Spaces'!C:C,MATCH(Observations!B105,'Units and Spaces'!B:B,0)))","v":""},null,null,"",null,null,null,null,null,"","",false,{"$f":"INDEX(EWEMs!$E$5:$E$24,MATCH(D105,EWEMs!$W$5:$W$24,0))","v":{"$error":"#N/A"}},"not bath","not kitchen",{"$error":"#VALUE!"},{"$f":"VLOOKUP(Observations!R105,EWEMs!$B$5:$D$24,3,FALSE)","v":{"$error":"#VALUE!"}}]
[null,null,{"$f":"IF(B106=\"\",\"\",INDEX('Units and Spaces'!C:C,MATCH(Observations!B106,'Units and Spaces'!B:B,0)))","v":""},null,null,"",null,null,null,null,null,"","",false,{"$f":"INDEX(EWEMs!$E$5:$E$24,MATCH(D106,EWEMs!$W$5:$W$24,0))","v":{"$error":"#N/A"}},"not bath","not kitchen",{"$error":"#VALUE!"},{"$f":"VLOOKUP(Observations!R106,EWEMs!$B$5:$D$24,3,FALSE)","v":{"$error":"#VALUE!"}}]
[null,null,{"$f":"IF(B107=\"\",\"\",INDEX('Units and Spaces'!C:C,MATCH(Observations!B107,'Units and Spaces'!B:B,0)))","v":""},null,null,"",null,null,null,null,null,"","",false,{"$f":"INDEX(EWEMs!$E$5:$E$24,MATCH(D107,EWEMs!$W$5:$W$24,0))","v":{"$error":"#N/A"}},"not bath","not kitchen",{"$error":"#VALUE!"},{"$f":"VLOOKUP(Observations!R107,EWEMs!$B$5:$D$24,3,FALSE)","v":{"$error":"#VALUE!"}}]
[null,null,{"$f":"IF(B108=\"\",\"\",INDEX('Units and Spaces'!C:C,MATCH(Observations!B108,'Units and Spaces'!B:B,0)))","v":""},null,null,"",null,null,null,null,null,"","",false,{"$f":"INDEX(EWEMs!$E$5:$E$24,MATCH(D108,EWEMs!$W$5:$W$24,0))","v":{"$error":"#N/A"}},"not bath","not kitchen",{"$error":"#VALUE!"},{"$f":"VLOOKUP(Observations!R108,EWEMs!$B$5:$D$24,3,FALSE)","v":{"$error":"#VALUE!"}}]
[null,null,{"$f":"IF(B109=\"\",\"\",INDEX('Units and Spaces'!C:C,MATCH(Observations!B109,'Units and Spaces'!B:B,0)))","v":""},null,null,"",null,null,null,null,null,"","",false,{"$f":"INDEX(EWEMs!$E$5:$E$24,MATCH(D109,EWEMs!$W$5:$W$24,0))","v":{"$error":"#N/A"}},"not bath","not kitchen",{"$error":"#VALUE!"},{"$f":"VLOOKUP(Observations!R109,EWEMs!$B$5:$D$24,3,FALSE)","v":{"$error":"#VALUE!"}}]
[null,null,{"$f":"IF(B110=\"\",\"\",INDEX('Units and Spaces'!C:C,MATCH(Observations!B110,'Units and Spaces'!B:B,0)))","v":""},null,null,"",null,null,null,null,null,"","",false,{"$f":"INDEX(EWEMs!$E$5:$E$24,MATCH(D110,EWEMs!$W$5:$W$24,0))","v":{"$error":"#N/A"}},"not bath","not kitchen",{"$error":"#VALUE!"},{"$f":"VLOOKUP(Observations!R110,EWEMs!$B$5:$D$24,3,FALSE)","v":{"$error":"#VALUE!"}}]
[null,null,{"$f":"IF(B111=\"\",\"\",INDEX('Units and Spaces'!C:C,MATCH(Observations!B111,'Units and Spaces'!B:B,0)))","v":""},null,null,"",null,null,null,null,null,"","",false,{"$f":"INDEX(EWEMs!$E$5:$E$24,MATCH(D111,EWEMs!$W$5:$W$24,0))","v":{"$error":"#N/A"}},"not bath","not kitchen",{"$error":"#VALUE!"},{"$f":"VLOOKUP(Observations!R111,EWEMs!$B$5:$D$24,3,FALSE)","v":{"$error":"#VALUE!"}}]
[null,null,{"$f":"IF(B112=\"\",\"\",INDEX('Units and Spaces'!C:C,MATCH(Observations!B112,'Units and Spaces'!B:B,0)))","v":""},null,null,"",null,null,null,null,null,"","",false,{"$f":"INDEX(EWEMs!$E$5:$E$24,MATCH(D112,EWEMs!$W$5:$W$24,0))","v":{"$error":"#N/A"}},"not bath","not kitchen",{"$error":"#VALUE!"},{"$f":"VLOOKUP(Observations!R112,EWEMs!$B$5:$D$24,3,FALSE)","v":{"$error":"#VALUE!"}}]
[null,null,{"$f":"IF(B113=\"\",\"\",INDEX('Units and Spaces'!C:C,MATCH(Observations!B113,'Units and Spaces'!B:B,0)))","v":""},null,null,"",null,null,null,null,null,"","",false,{"$f":"INDEX(EWEMs!$E$5:$E$24,MATCH(D113,EWEMs!$W$5:$W$24,0))","v":{"$error":"#N/A"}},"not bath","not kitchen",{"$error":"#VALUE!"},{"$f":"VLOOKUP(Observations!R113,EWEMs!$B$5:$D$24,3,FALSE)","v":{"$error":"#VALUE!"}}]
[null,null,{"$f":"IF(B114=\"\",\"\",INDEX('Units and Spaces'!C:C,MATCH(Observations!B114,'Units and Spaces'!B:B,0)))","v":""},null,null,"",null,null,null,null,null,"","",false,{"$f":"INDEX(EWEMs!$E$5:$E$24,MATCH(D114,EWEMs!$W$5:$W$24,0))","v":{"$error":"#N/A"}},"not bath","not kitchen",{"$error":"#VALUE!"},{"$f":"VLOOKUP(Observations!R114,EWEMs!$B$5:$D$24,3,FALSE)","v":{"$error":"#VALUE!"}}]
[null,null,{"$f":"IF(B115=\"\",\"\",INDEX('Units and Spaces'!C:C,MATCH(Observations!B115,'Units and Spaces'!B:B,0)))","v":""},null,null,"",null,null,null,null,null,"","",false,{"$f":"INDEX(EWEMs!$E$5:$E$24,MATCH(D115,EWEMs!$W$5:$W$24,0))","v":{"$error":"#N/A"}},"not bath","not kitchen",{"$error":"#VALUE!"},{"$f":"VLOOKUP(Observations!R115,EWEMs!$B$5:$D$24,3,FALSE)","v":{"$error":"#VALUE!"}}]
[null,null,{"$f":"IF(B116=\"\",\"\",INDEX('Units and Spaces'!C:C,MATCH(Observations!B116,'Units and Spaces'!B:B,0)))","v":""},null,null,"",null,null,null,null,null,"","",false,{"$f":"INDEX(EWEMs!$E$5:$E$24,MATCH(D116,EWEMs!$W$5:$W$24,0))","v":{"$error":"#N/A"}},"not bath","not kitchen",{"$error":"#VALUE!"},{"$f":"VLOOKUP(Observations!R116,EWEMs!$B$5:$D$24,3,FALSE)","v":{"$error":"#VALUE!"}}]
[null,null,{"$f":"IF(B117=\"\",\"\",INDEX('Units and Spaces'!C:C,MATCH(Observations!B117,'Units and Spaces'!B:B,0)))","v":""},null,null,"",null,null,null,null,null,"","",false,{"$f":"INDEX(EWEMs!$E$5:$E$24,MATCH(D117,EWEMs!$W$5:$W$24,0))","v":{"$error":"#N/A"}},"not bath","not kitchen",{"$error":"#VALUE!"},{"$f":"VLOOKUP(Observations!R117,EWEMs!$B$5:$D$24,3,FALSE)","v":{"$error":"#VALUE!"}}]
[null,null,{"$f":"IF(B118=\"\",\"\",INDEX('Units and Spaces'!C:C,MATCH(Observations!B118,'Units and Spaces'!B:B,0)))","v":""},null,null,"",null,null,null,null,null,"","",false,{"$f":"INDEX(EWEMs!$E$5:$E$24,MATCH(D118,EWEMs!$W$5:$W$24,0))","v":{"$error":"#N/A"}},"not bath","not kitchen",{"$error":"#VALUE!"},{"$f":"VLOOKUP(Observations!R118,EWEMs!$B$5:$D$24,3,FALSE)","v":{"$error":"#VALUE!"}}]
[null,null,{"$f":"IF(B119=\"\",\"\",INDEX('Units and Spaces'!C:C,MATCH(Observations!B119,'Units and Spaces'!B:B,0)))","v":""},null,null,"",null,null,null,null,null,"","",false,{"$f":"INDEX(EWEMs!$E$5:$E$24,MATCH(D119,EWEMs!$W$5:$W$24,0))","v":{"$error":"#N/A"}},"not bath","not kitchen",{"$error":"#VALUE!"},{"$f":"VLOOKUP(Observations!R119,EWEMs!$B$5:$D$24,3,FALSE)","v":{"$error":"#VALUE!"}}]
[null,null,{"$f":"IF(B120=\"\",\"\",INDEX('Units and Spaces'!C:C,MATCH(Observations!B120,'Units and Spaces'!B:B,0)))","v":""},null,null,"",null,null,null,null,null,"","",false,{"$f":"INDEX(EWEMs!$E$5:$E$24,MATCH(D120,EWEMs!$W$5:$W$24,0))","v":{"$error":"#N/A"}},"not bath","not kitchen",{"$error":"#VALUE!"},{"$f":"VLOOKUP(Observations!R120,EWEMs!$B$5:$D$24,3,FALSE)","v":{"$error":"#VALUE!"}}]
[null,null,{"$f":"IF(B121=\"\",\"\",INDEX('Units and Spaces'!C:C,MATCH(Observations!B121,'Units and Spaces'!B:B,0)))","v":""},null,null,"",null,null,null,null,null,"","",false,{"$f":"INDEX(EWEMs!$E$5:$E$24,MATCH(D121,EWEMs!$W$5:$W$24,0))","v":{"$error":"#N/A"}},"not bath","not kitchen",{"$error":"#VALUE!"},{"$f":"VLOOKUP(Observations!R121,EWEMs!$B$5:$D$24,3,FALSE)","v":{"$error":"#VALUE!"}}]
[null,null,{"$f":"IF(B122=\"\",\"\",INDEX('Units and Spaces'!C:C,MATCH(Observations!B122,'Units and Spaces'!B:B,0)))","v":""},null,null,"",null,null,null,null,null,"","",false,{"$f":"INDEX(EWEMs!$E$5:$E$24,MATCH(D122,EWEMs!$W$5:$W$24,0))","v":{"$error":"#N/A"}},"not bath","not kitchen",{"$error":"#VALUE!"},{"$f":"VLOOKUP(Observations!R122,EWEMs!$B$5:$D$24,3,FALSE)","v":{"$error":"#VALUE!"}}]
[null,null,{"$f":"IF(B123=\"\",\"\",INDEX('Units and Spaces'!C:C,MATCH(Observations!B123,'Units and Spaces'!B:B,0)))","v":""},null,null,"",null,null,null,null,null,"","",false,{"$f":"INDEX(EWEMs!$E$5:$E$24,MATCH(D123,EWEMs!$W$5:$W$24,0))","v":{"$error":"#N/A"}},"not bath","not kitchen",{"$error":"#VALUE!"},{"$f":"VLOOKUP(Observations!R123,EWEMs!$B$5:$D$24,3,FALSE)","v":{"$error":"#VALUE!"}}]
[null,null,{"$f":"IF(B124=\"\",\"\",INDEX('Units and Spaces'!C:C,MATCH(Observations!B124,'Units and Spaces'!B:B,0)))","v":""},null,null,"",null,null,null,null,null,"","",false,{"$f":"INDEX(EWEMs!$E$5:$E$24,MATCH(D124,EWEMs!$W$5:$W$24,0))","v":{"$error":"#N/A"}},"not bath","not kitchen",{"$error":"#VALUE!"},{"$f":"VLOOKUP(Observations!R124,EWEMs!$B$5:$D$24,3,FALSE)","v":{"$error":"#VALUE!"}}]
[null,null,{"$f":"IF(B125=\"\",\"\",INDEX('Units and Spaces'!C:C,MATCH(Observations!B125,'Units and Spaces'!B:B,0)))","v":""},null,null,"",null,null,null,null,null,"","",false,{"$f":"INDEX(EWEMs!$E$5:$E$24,MATCH(D125,EWEMs!$W$5:$W$24,0))","v":{"$error":"#N/A"}},"not bath","not kitchen",{"$error":"#VALUE!"},{"$f":"VLOOKUP(Observations!R125,EWEMs!$B$5:$D$24,3,FALSE)","v":{"$error":"#VALUE!"}}]
[null,null,{"$f":"IF(B126=\"\",\"\",INDEX('Units and Spaces'!C:C,MATCH(Observations!B126,'Units and Spaces'!B:B,0)))","v":""},null,null,"",null,null,null,null,null,"","",false,{"$f":"INDEX(EWEMs!$E$5:$E$24,MATCH(D126,EWEMs!$W$5:$W$24,0))","v":{"$error":"#N/A"}},"not bath","not kitchen",{"$error":"#VALUE!"},{"$f":"VLOOKUP(Observations!R126,EWEMs!$B$5:$D$24,3,FALSE)","v":{"$error":"#VALUE!"}}]
[null,null,{"$f":"IF(B127=\"\",\"\",INDEX('Units and Spaces'!C:C,MATCH(Observations!B127,'Units and Spaces'!B:B,0)))","v":""},null,null,"",null,null,null,null,null,"","",false,{"$f":"INDEX(EWEMs!$E$5:$E$24,MATCH(D127,EWEMs!$W$5:$W$24,0))","v":{"$error":"#N/A"}},"not bath","not kitchen",{"$error":"#VALUE!"},{"$f":"VLOOKUP(Observations!R127,EWEMs!$B$5:$D$24,3,FALSE)","v":{"$error":"#VALUE!"}}]
[null,null,{"$f":"IF(B128=\"\",\"\",INDEX('Units and Spaces'!C:C,MATCH(Observations!B128,'Units and Spaces'!B:B,0)))","v":""},null,null,"",null,null,null,null,null,"","",false,{"$f":"INDEX(EWEMs!$E$5:$E$24,MATCH(D128,EWEMs!$W$5:$W$24,0))","v":{"$error":"#N/A"}},"not bath","not kitchen",{"$error":"#VALUE!"},{"$f":"VLOOKUP(Observations!R128,EWEMs!$B$5:$D$24,3,FALSE)","v":{"$error":"#VALUE!"}}]
[null,null,{"$f":"IF(B129=\"\",\"\",INDEX('Units and Spaces'!C:C,MATCH(Observations!B129,'Units and Spaces'!B:B,0)))","v":""},null,null,"",null,null,null,null,null,"","",false,{"$f":"INDEX(EWEMs!$E$5:$E$24,MATCH(D129,EWEMs!$W$5:$W$24,0))","v":{"$error":"#N/A"}},"not bath","not kitchen",{"$error":"#VALUE!"},{"$f":"VLOOKUP(Observations!R129,EWEMs!$B$5:$D$24,3,FALSE)","v":{"$error":"#VALUE!"}}]
[null,null,{"$f":"IF(B130=\"\",\"\",INDEX('Units and Spaces'!C:C,MATCH(Observations!B130,'Units and Spaces'!B:B,0)))","v":""},null,null,"",null,null,null,null,null,"","",false,{"$f":"INDEX(EWEMs!$E$5:$E$24,MATCH(D130,EWEMs!$W$5:$W$24,0))","v":{"$error":"#N/A"}},"not bath","not kitchen",{"$error":"#VALUE!"},{"$f":"VLOOKUP(Observations!R130,EWEMs!$B$5:$D$24,3,FALSE)","v":{"$error":"#VALUE!"}}]
[null,null,{"$f":"IF(B131=\"\",\"\",INDEX('Units and Spaces'!C:C,MATCH(Observations!B131,'Units and Spaces'!B:B,0)))","v":""},null,null,"",null,null,null,null,null,"","",false,{"$f":"INDEX(EWEMs!$E$5:$E$24,MATCH(D131,EWEMs!$W$5:$W$24,0))","v":{"$error":"#N/A"}},"not bath","not kitchen",{"$error":"#VALUE!"},{"$f":"VLOOKUP(Observations!R131,EWEMs!$B$5:$D$24,3,FALSE)","v":{"$error":"#VALUE!"}}]
[null,null,{"$f":"IF(B132=\"\",\"\",INDEX('Units and Spaces'!C:C,MATCH(Observations!B132,'Units and Spaces'!B:B,0)))","v":""},null,null,"",null,null,null,null,null,"","",false,{"$f":"INDEX(EWEMs!$E$5:$E$24,MATCH(D132,EWEMs!$W$5:$W$24,0))","v":{"$error":"#N/A"}},"not bath","not kitchen",{"$error":"#VALUE!"},{"$f":"VLOOKUP(Observations!R132,EWEMs!$B$5:$D$24,3,FALSE)","v":{"$error":"#VALUE!"}}]
[null,null,{"$f":"IF(B133=\"\",\"\",INDEX('Units and Spaces'!C:C,MATCH(Observations!B133,'Units and Spaces'!B:B,0)))","v":""},null,null,"",null,null,null,null,null,"","",false,{"$f":"INDEX(EWEMs!$E$5:$E$24,MATCH(D133,EWEMs!$W$5:$W$24,0))","v":{"$error":"#N/A"}},"not bath","not kitchen",{"$error":"#VALUE!"},{"$f":"VLOOKUP(Observations!R133,EWEMs!$B$5:$D$24,3,FALSE)","v":{"$error":"#VALUE!"}}]
[null,null,{"$f":"IF(B134=\"\",\"\",INDEX('Units and Spaces'!C:C,MATCH(Observations!B134,'Units and Spaces'!B:B,0)))","v":""},null,null,"",null,null,null,null,null,"","",false,{"$f":"INDEX(EWEMs!$E$5:$E$24,MATCH(D134,EWEMs!$W$5:$W$24,0))","v":{"$error":"#N/A"}},"not bath","not kitchen",{"$error":"#VALUE!"},{"$f":"VLOOKUP(Observations!R134,EWEMs!$B$5:$D$24,3,FALSE)","v":{"$error":"#VALUE!"}}]
[null,null,{"$f":"IF(B135=\"\",\"\",INDEX('Units and Spaces'!C:C,MATCH(Observations!B135,'Units and Spaces'!B:B,0)))","v":""},null,null,"",null,null,null,null,null,"","",false,{"$f":"INDEX(EWEMs!$E$5:$E$24,MATCH(D135,EWEMs!$W$5:$W$24,0))","v":{"$error":"#N/A"}},"not bath","not kitchen",{"$error":"#VALUE!"},{"$f":"VLOOKUP(Observations!R135,EWEMs!$B$5:$D$24,3,FALSE)","v":{"$error":"#VALUE!"}}]
[null,null,{"$f":"IF(B136=\"\",\"\",INDEX('Units and Spaces'!C:C,MATCH(Observations!B136,'Units and Spaces'!B:B,0)))","v":""},null,null,{"$f":"IF(AND(N136=TRUE,E136<>\"\"), IF(ISNUMBER(SEARCH(\"compliant\", P136)),P136,IF(ISNUMBER(SEARCH(\"compliant\",Q136)),Q136,IF(E136<=O136,\"compliant\",\"noncompliant\"))),\"\")","v":""},null,null,null,null,null,{"$f":"IF(OR(F136=\"compliant\",F136=\"noncompliant\"),D136&F136,D136&G136)","v":""},{"$f":"IF(C136=\"Apartment\",IF(B136=0,\"\",B136),\"\")","v":""},{"$f":"IF(OR(ISNUMBER(FIND(\"low-flow\",D136,1)), ISNUMBER(FIND(\"low-flush\",D136,1))),TRUE,FALSE)","v":false},{"$f":"INDEX(EWEMs!$E$5:$E$24,MATCH(D136,EWEMs!$W$5:$W$24,0))","v":{"$error":"#N/A"}},{"$f":"IF(OR(ISNUMBER(SEARCH(\"bath faucets\", D136)), AND( ISNUMBER(SEARCH(\"fixture\", D136)),ISNUMBER(SEARCH(\"bath\", S136)) )), IF(O136<=1, IF(AND(E136>=O136, E136<=1), \"compliant\", \"noncompliant\"), IF(AND(E136>=1, E136<=O136),\"compliant\",\"noncompliant\")), \"not bath\"\n)","v":"not bath"},{"$f":"IF(OR(ISNUMBER(SEARCH(\"kitchen faucets\", D136)), AND(ISNUMBER(SEARCH(\"fixtures\", D136)),ISNUMBER(SEARCH(\"kitchen\", S136)) )), IF(O136<=1.5, IF(AND(E136>=O136, E136<=1.5), \"compliant\", \"noncompliant\"), IF(AND(E136>=1.5, E136<=O136),\"compliant\",\"noncompliant\")), \"not kitchen\"\n)","v":"not kitchen"},{"$f":"LEFT(D136,(FIND(\" \",D136,1)-1))*1","v":{"$error":"#VALUE!"}},{"$f":"VLOOKUP(Observations!R136,EWEMs!$B$5:$D$24,3,FALSE)","v":{"$error":"#VALUE!"}}]
[null,null,{"$f":"IF(B137=\"\",\"\",INDEX('Units and Spaces'!C:C,MATCH(Observations!B137,'Units and Spaces'!B:B,0)))","v":""},null,null,"",null,null,null,null,null,"","",false,{"$f":"INDEX(EWEMs!$E$5:$E$24,MATCH(D137,EWEMs!$W$5:$W$24,0))","v":{"$error":"#N/A"}},"not bath","not kitchen",{"$error":"#VALUE!"},{"$f":"VLOOKUP(Observations!R137,EWEMs!$B$5:$D$24,3,FALSE)","v":{"$error":"#VALUE!"}}]
[null,null,{"$f":"IF(B138=\"\",\"\",INDEX('Units and Spaces'!C:C,MATCH(Observations!B138,'Units and Spaces'!B:B,0)))","v":""},null,null,"",null,null,null,null,null,"","",false,{"$f":"INDEX(EWEMs!$E$5:$E$24,MATCH(D138,EWEMs!$W$5:$W$24,0))","v":{"$error":"#N/A"}},"not bath","not kitchen",{"$error":"#VALUE!"},{"$f":"VLOOKUP(Observations!R138,EWEMs!$B$5:$D$24,3,FALSE)","v":{"$error":"#VALUE!"}}]
[null,null,{"$f":"IF(B139=\"\",\"\",INDEX('Units and Spaces'!C:C,MATCH(Observations!B139,'Units and Spaces'!B:B,0)))","v":""},null,null,"",null,null,null,null,null,"","",false,{"$f":"INDEX(EWEMs!$E$5:$E$24,MATCH(D139,EWEMs!$W$5:$W$24,0))","v":{"$error":"#N/A"}},"not bath","not kitchen",{"$error":"#VALUE!"},{"$f":"VLOOKUP(Observations!R139,EWEMs!$B$5:$D$24,3,FALSE)","v":{"$error":"#VALUE!"}}]
[null,null,{"$f":"IF(B140=\"\",\"\",INDEX('Units and Spaces'!C:C,MATCH(Observations!B140,'Units and Spaces'!B:B,0)))","v":""},null,null,"",null,null,null,null,null,"","",false,{"$f":"INDEX(EWEMs!$E$5:$E$24,MATCH(D140,EWEMs!$W$5:$W$24,0))","v":{"$error":"#N/A"}},"not bath","not kitchen",{"$error":"#VALUE!"},{"$f":"VLOOKUP(Observations!R140,EWEMs!$B$5:$D$24,3,FALSE)","v":{"$error":"#VALUE!"}}]
[null,null,{"$f":"IF(B141=\"\",\"\",INDEX('Units and Spaces'!C:C,MATCH(Observations!B141,'Units and Spaces'!B:B,0)))","v":""},null,null,"",null,null,null,null,null,"","",false,{"$f":"INDEX(EWEMs!$E$5:$E$24,MATCH(D141,EWEMs!$W$5:$W$24,0))","v":{"$error":"#N/A"}},"not bath","not kitchen",{"$error":"#VALUE!"},{"$f":"VLOOKUP(Observations!R141,EWEMs!$B$5:$D$24,3,FALSE)","v":{"$error":"#VALUE!"}}]
[null,null,{"$f":"IF(B142=\"\",\"\",INDEX('Units and Spaces'!C:C,MATCH(Observations!B142,'Units and Spaces'!B:B,0)))","v":""},null,null,"",null,null,null,null,null,"","",false,{"$f":"INDEX(EWEMs!$E$5:$E$24,MATCH(D142,EWEMs!$W$5:$W$24,0))","v":{"$error":"#N/A"}},"not bath","not kitchen",{"$error":"#VALUE!"},{"$f":"VLOOKUP(Observations!R142,EWEMs!$B$5:$D$24,3,FALSE)","v":{"$error":"#VALUE!"}}]
[null,null,{"$f":"IF(B143=\"\",\"\",INDEX('Units and Spaces'!C:C,MATCH(Observations!B143,'Units and Spaces'!B:B,0)))","v":""},null,null,"",null,null,null,null,null,"","",false,{"$f":"INDEX(EWEMs!$E$5:$E$24,MATCH(D143,EWEMs!$W$5:$W$24,0))","v":{"$error":"#N/A"}},"not bath","not kitchen",{"$error":"#VALUE!"},{"$f":"VLOOKUP(Observations!R143,EWEMs!$B$5:$D$24,3,FALSE)","v":{"$error":"#VALUE!"}}]
[null,null,{"$f":"IF(B144=\"\",\"\",INDEX('Units and Spaces'!C:C,MATCH(Observations!B144,'Units and Spaces'!B:B,0)))","v":""},null,null,"",null,null,null,null,null,"","",false,{"$f":"INDEX(EWEMs!$E$5:$E$24,MATCH(D144,EWEMs!$W$5:$W$24,0))","v":{"$error":"#N/A"}},"not bath","not kitchen",{"$error":"#VALUE!"},{"$f":"VLOOKUP(Observations!R144,EWEMs!$B$5:$D$24,3,FALSE)","v":{"$error":"#VALUE!"}}]
[null,null,{"$f":"IF(B145=\"\",\"\",INDEX('Units and Spaces'!C:C,MATCH(Observations!B145,'Units and Spaces'!B:B,0)))","v":""},null,null,"",null,null,null,null,null,"","",false,{"$f":"INDEX(EWEMs!$E$5:$E$24,MATCH(D145,EWEMs!$W$5:$W$24,0))","v":{"$error":"#N/A"}},"not bath","not kitchen",{"$error":"#VALUE!"},{"$f":"VLOOKUP(Observations!R145,EWEMs!$B$5:$D$24,3,FALSE)","v":{"$error":"#VALUE!"}}]
[null,null,{"$f":"IF(B146=\"\",\"\",INDEX('Units and Spaces'!C:C,MATCH(Observations!B146,'Units and Spaces'!B:B,0)))","v":""},null,null,"",null,null,null,null,null,"","",false,{"$f":"INDEX(EWEMs!$E$5:$E$24,MATCH(D146,EWEMs!$W$5:$W$24,0))","v":{"$error":"#N/A"}},"not bath","not kitchen",{"$error":"#VALUE!"},{"$f":"VLOOKUP(Observations!R146,EWEMs!$B$5:$D$24,3,FALSE)","v":{"$error":"#VALUE!"}}]
[null,null,{"$f":"IF(B147=\"\",\"\",INDEX('Units and Spaces'!C:C,MATCH(Observations!B147,'Units and Spaces'!B:B,0)))","v":""},null,null,"",null,null,null,null,null,"","",false,{"$f":"INDEX(EWEMs!$E$5:$E$24,MATCH(D147,EWEMs!$W$5:$W$24,0))","v":{"$error":"#N/A"}},"not bath","not kitchen",{"$error":"#VALUE!"},{"$f":"VLOOKUP(Observations!R147,EWEMs!$B$5:$D$24,3,FALSE)","v":{"$error":"#VALUE!"}}]
[null,null,{"$f":"IF(B148=\"\",\"\",INDEX('Units and Spaces'!C:C,MATCH(Observations!B148,'Units and Spaces'!B:B,0)))","v":""},null,null,"",null,null,null,null,null,"","",false,{"$f":"INDEX(EWEMs!$E$5:$E$24,MATCH(D148,EWEMs!$W$5:$W$24,0))","v":{"$error":"#N/A"}},"not bath","not kitchen",{"$error":"#VALUE!"},{"$f":"VLOOKUP(Observations!R148,EWEMs!$B$5:$D$24,3,FALSE)","v":{"$error":"#VALUE!"}}]
[null,null,{"$f":"IF(B149=\"\",\"\",INDEX('Units and Spaces'!C:C,MATCH(Observations!B149,'Units and Spaces'!B:B,0)))","v":""},null,null,"",null,null,null,null,null,"","",false,{"$f":"INDEX(EWEMs!$E$5:$E$24,MATCH(D149,EWEMs!$W$5:$W$24,0))","v":{"$error":"#N/A"}},"not bath","not kitchen",{"$error":"#VALUE!"},{"$f":"VLOOKUP(Observations!R149,EWEMs!$B$5:$D$24,3,FALSE)","v":{"$error":"#VALUE!"}}]
[null,null,{"$f":"IF(B150=\"\",\"\",INDEX('Units and Spaces'!C:C,MATCH(Observations!B150,'Units and Spaces'!B:B,0)))","v":""},null,null,"",null,null,null,null,null,"","",false,{"$f":"INDEX(EWEMs!$E$5:$E$24,MATCH(D150,EWEMs!$W$5:$W$24,0))","v":{"$error":"#N/A"}},"not bath","not kitchen",{"$error":"#VALUE!"},{"$f":"VLOOKUP(Observations!R150,EWEMs!$B$5:$D$24,3,FALSE)","v":{"$error":"#VALUE!"}}]
[null,null,{"$f":"IF(B151=\"\",\"\",INDEX('Units and Spaces'!C:C,MATCH(Observations!B151,'Units and Spaces'!B:B,0)))","v":""},null,null,"",null,null,null,null,null,"","",false,{"$f":"INDEX(EWEMs!$E$5:$E$24,MATCH(D151,EWEMs!$W$5:$W$24,0))","v":{"$error":"#N/A"}},"not bath","not kitchen",{"$error":"#VALUE!"},{"$f":"VLOOKUP(Observations!R151,EWEMs!$B$5:$D$24,3,FALSE)","v":{"$error":"#VALUE!"}}]
[null,null,{"$f":"IF(B152=\"\",\"\",INDEX('Units and Spaces'!C:C,MATCH(Observations!B152,'Units and Spaces'!B:B,0)))","v":""},null,null,"",null,null,null,null,null,"","",false,{"$f":"INDEX(EWEMs!$E$5:$E$24,MATCH(D152,EWEMs!$W$5:$W$24,0))","v":{"$error":"#N/A"}},"not bath","not kitchen",{"$error":"#VALUE!"},{"$f":"VLOOKUP(Observations!R152,EWEMs!$B$5:$D$24,3,FALSE)","v":{"$error":"#VALUE!"}}]
[null,null,{"$f":"IF(B153=\"\",\"\",INDEX('Units and Spaces'!C:C,MATCH(Observations!B153,'Units and Spaces'!B:B,0)))","v":""},null,null,"",null,null,null,null,null,"","",false,{"$f":"INDEX(EWEMs!$E$5:$E$24,MATCH(D153,EWEMs!$W$5:$W$24,0))","v":{"$error":"#N/A"}},"not bath","not kitchen",{"$error":"#VALUE!"},{"$f":"VLOOKUP(Observations!R153,EWEMs!$B$5:$D$24,3,FALSE)","v":{"$error":"#VALUE!"}}]
[null,null,{"$f":"IF(B154=\"\",\"\",INDEX('Units and Spaces'!C:C,MATCH(Observations!B154,'Units and Spaces'!B:B,0)))","v":""},null,null,"",null,null,null,null,null,"","",false,{"$f":"INDEX(EWEMs!$E$5:$E$24,MATCH(D154,EWEMs!$W$5:$W$24,0))","v":{"$error":"#N/A"}},"not bath","not kitchen",{"$error":"#VALUE!"},{"$f":"VLOOKUP(Observations!R154,EWEMs!$B$5:$D$24,3,FALSE)","v":{"$error":"#VALUE!"}}]
[null,null,{"$f":"IF(B155=\"\",\"\",INDEX('Units and Spaces'!C:C,MATCH(Observations!B155,'Units and Spaces'!B:B,0)))","v":""},null,null,"",null,null,null,null,null,"","",false,{"$f":"INDEX(EWEMs!$E$5:$E$24,MATCH(D155,EWEMs!$W$5:$W$24,0))","v":{"$error":"#N/A"}},"not bath","not kitchen",{"$error":"#VALUE!"},{"$f":"VLOOKUP(Observations!R155,EWEMs!$B$5:$D$24,3,FALSE)","v":{"$error":"#VALUE!"}}]
[null,null,{"$f":"IF(B156=\"\",\"\",INDEX('Units and Spaces'!C:C,MATCH(Observations!B156,'Units and Spaces'!B:B,0)))","v":""},null,null,"",null,null,null,null,null,"","",false,{"$f":"INDEX(EWEMs!$E$5:$E$24,MATCH(D156,EWEMs!$W$5:$W$24,0))","v":{"$error":"#N/A"}},"not bath","not kitchen",{"$error":"#VALUE!"},{"$f":"VLOOKUP(Observations!R156,EWEMs!$B$5:$D$24,3,FALSE)","v":{"$error":"#VALUE!"}}]
[null,null,{"$f":"IF(B157=\"\",\"\",INDEX('Units and Spaces'!C:C,MATCH(Observations!B157,'Units and Spaces'!B:B,0)))","v":""},null,null,"",null,null,null,null,null,"","",false,{"$f":"INDEX(EWEMs!$E$5:$E$24,MATCH(D157,EWEMs!$W$5:$W$24,0))","v":{"$error":"#N/A"}},"not bath","not kitchen",{"$error":"#VALUE!"},{"$f":"VLOOKUP(Observations!R157,EWEMs!$B$5:$D$24,3,FALSE)","v":{"$error":"#VALUE!"}}]
[null,null,{"$f":"IF(B158=\"\",\"\",INDEX('Units and Spaces'!C:C,MATCH(Observations!B158,'Units and Spaces'!B:B,0)))","v":""},null,null,"",null,null,null,null,null,"","",false,{"$f":"INDEX(EWEMs!$E$5:$E$24,MATCH(D158,EWEMs!$W$5:$W$24,0))","v":{"$error":"#N/A"}},"not bath","not kitchen",{"$error":"#VALUE!"},{"$f":"VLOOKUP(Observations!R158,EWEMs!$B$5:$D$24,3,FALSE)","v":{"$error":"#VALUE!"}}]
[null,null,{"$f":"IF(B159=\"\",\"\",INDEX('Units and Spaces'!C:C,MATCH(Observations!B159,'Units and Spaces'!B:B,0)))","v":""},null,null,"",null,null,null,null,null,"","",false,{"$f":"INDEX(EWEMs!$E$5:$E$24,MATCH(D159,EWEMs!$W$5:$W$24,0))","v":{"$error":"#N/A"}},"not bath","not kitchen",{"$error":"#VALUE!"},{"$f":"VLOOKUP(Observations!R159,EWEMs!$B$5:$D$24,3,FALSE)","v":{"$error":"#VALUE!"}}]
[null,null,{"$f":"IF(B160=\"\",\"\",INDEX('Units and Spaces'!C:C,MATCH(Observations!B160,'Units and Spaces'!B:B,0)))","v":""},null,null,"",null,null,null,null,null,"","",false,{"$f":"INDEX(EWEMs!$E$5:$E$24,MATCH(D160,EWEMs!$W$5:$W$24,0))","v":{"$error":"#N/A"}},"not bath","not kitchen",{"$error":"#VALUE!"},{"$f":"VLOOKUP(Observations!R160,EWEMs!$B$5:$D$24,3,FALSE)","v":{"$error":"#VALUE!"}}]
[null,null,{"$f":"IF(B161=\"\",\"\",INDEX('Units and Spaces'!C:C,MATCH(Observations!B161,'Units and Spaces'!B:B,0)))","v":""},null,null,"",null,null,null,null,null,"","",false,{"$f":"INDEX(EWEMs!$E$5:$E$24,MATCH(D161,EWEMs!$W$5:$W$24,0))","v":{"$error":"#N/A"}},"not bath","not kitchen",{"$error":"#VALUE!"},{"$f":"VLOOKUP(Observations!R161,EWEMs!$B$5:$D$24,3,FALSE)","v":{"$error":"#VALUE!"}}]
[null,null,{"$f":"IF(B162=\"\",\"\",INDEX('Units and Spaces'!C:C,MATCH(Observations!B162,'Units and Spaces'!B:B,0)))","v":""},null,null,"",null,null,null,null,null,"","",false,{"$f":"INDEX(EWEMs!$E$5:$E$24,MATCH(D162,EWEMs!$W$5:$W$24,0))","v":{"$error":"#N/A"}},"not bath","not kitchen",{"$error":"#VALUE!"},{"$f":"VLOOKUP(Observations!R162,EWEMs!$B$5:$D$24,3,FALSE)","v":{"$error":"#VALUE!"}}]
[null,null,{"$f":"IF(B163=\"\",\"\",INDEX('Units and Spaces'!C:C,MATCH(Observations!B163,'Units and Spaces'!B:B,0)))","v":""},null,null,"",null,null,null,null,null,"","",false,{"$f":"INDEX(EWEMs!$E$5:$E$24,MATCH(D163,EWEMs!$W$5:$W$24,0))","v":{"$error":"#N/A"}},"not bath","not kitchen",{"$error":"#VALUE!"},{"$f":"VLOOKUP(Observations!R163,EWEMs!$B$5:$D$24,3,FALSE)","v":{"$error":"#VALUE!"}}]
[null,null,{"$f":"IF(B164=\"\",\"\",INDEX('Units and Spaces'!C:C,MATCH(Observations!B164,'Units and Spaces'!B:B,0)))","v":""},null,null,"",null,null,null,null,null,"","",false,{"$f":"INDEX(EWEMs!$E$5:$E$24,MATCH(D164,EWEMs!$W$5:$W$24,0))","v":{"$error":"#N/A"}},"not bath","not kitchen",{"$error":"#VALUE!"},{"$f":"VLOOKUP(Observations!R164,EWEMs!$B$5:$D$24,3,FALSE)","v":{"$error":"#VALUE!"}}]
[null,null,{"$f":"IF(B165=\"\",\"\",INDEX('Units and Spaces'!C:C,MATCH(Observations!B165,'Units and Spaces'!B:B,0)))","v":""},null,null,"",null,null,null,null,null,"","",false,{"$f":"INDEX(EWEMs!$E$5:$E$24,MATCH(D165,EWEMs!$W$5:$W$24,0))","v":{"$error":"#N/A"}},"not bath","not kitchen",{"$error":"#VALUE!"},{"$f":"VLOOKUP(Observations!R165,EWEMs!$B$5:$D$24,3,FALSE)","v":{"$error":"#VALUE!"}}]
[null,null,{"$f":"IF(B166=\"\",\"\",INDEX('Units and Spaces'!C:C,MATCH(Observations!B166,'Units and Spaces'!B:B,0)))","v":""},null,null,"",null,null,null,null,null,"","",false,{"$f":"INDEX(EWEMs!$E$5:$E$24,MATCH(D166,EWEMs!$W$5:$W$24,0))","v":{"$error":"#N/A"}},"not bath","not kitchen",{"$error":"#VALUE!"},{"$f":"VLOOKUP(Observations!R166,EWEMs!$B$5:$D$24,3,FALSE)","v":{"$error":"#VALUE!"}}]
[null,null,{"$f":"IF(B167=\"\",\"\",INDEX('Units and Spaces'!C:C,MATCH(Observations!B167,'Units and Spaces'!B:B,0)))","v":""},null,null,"",null,null,null,null,null,"","",false,{"$f":"INDEX(EWEMs!$E$5:$E$24,MATCH(D167,EWEMs!$W$5:$W$24,0))","v":{"$error":"#N/A"}},"not bath","not kitchen",{"$error":"#VALUE!"},{"$f":"VLOOKUP(Observations!R167,EWEMs!$B$5:$D$24,3,FALSE)","v":{"$error":"#VALUE!"}}]
[null,null,{"$f":"IF(B168=\"\",\"\",INDEX('Units and Spaces'!C:C,MATCH(Observations!B168,'Units and Spaces'!B:B,0)))","v":""},null,null,"",null,null,null,null,null,"","",false,{"$f":"INDEX(EWEMs!$E$5:$E$24,MATCH(D168,EWEMs!$W$5:$W$24,0))","v":{"$error":"#N/A"}},"not bath","not kitchen",{"$error":"#VALUE!"},{"$f":"VLOOKUP(Observations!R168,EWEMs!$B$5:$D$24,3,FALSE)","v":{"$error":"#VALUE!"}}]
[null,null,{"$f":"IF(B169=\"\",\"\",INDEX('Units and Spaces'!C:C,MATCH(Observations!B169,'Units and Spaces'!B:B,0)))","v":""},null,null,"",null,null,null,null,null,"","",false,{"$f":"INDEX(EWEMs!$E$5:$E$24,MATCH(D169,EWEMs!$W$5:$W$24,0))","v":{"$error":"#N/A"}},"not bath","not kitchen",{"$error":"#VALUE!"},{"$f":"VLOOKUP(Observations!R169,EWEMs!$B$5:$D$24,3,FALSE)","v":{"$error":"#VALUE!"}}]
[null,null,{"$f":"IF(B170=\"\",\"\",INDEX('Units and Spaces'!C:C,MATCH(Observations!B170,'Units and Spaces'!B:B,0)))","v":""},null,null,"",null,null,null,null,null,"","",false,{"$f":"INDEX(EWEMs!$E$5:$E$24,MATCH(D170,EWEMs!$W$5:$W$24,0))","v":{"$error":"#N/A"}},"not bath","not kitchen",{"$error":"#VALUE!"},{"$f":"VLOOKUP(Observations!R170,EWEMs!$B$5:$D$24,3,FALSE)","v":{"$error":"#VALUE!"}}]
[null,null,{"$f":"IF(B171=\"\",\"\",INDEX('Units and Spaces'!C:C,MATCH(Observations!B171,'Units and Spaces'!B:B,0)))","v":""},null,null,"",null,null,null,null,null,"","",false,{"$f":"INDEX(EWEMs!$E$5:$E$24,MATCH(D171,EWEMs!$W$5:$W$24,0))","v":{"$error":"#N/A"}},"not bath","not kitchen",{"$error":"#VALUE!"},{"$f":"VLOOKUP(Observations!R171,EWEMs!$B$5:$D$24,3,FALSE)","v":{"$error":"#VALUE!"}}]
[null,null,{"$f":"IF(B172=\"\",\"\",INDEX('Units and Spaces'!C:C,MATCH(Observations!B172,'Units and Spaces'!B:B,0)))","v":""},null,null,"",null,null,null,null,null,"","",false,{"$f":"INDEX(EWEMs!$E$5:$E$24,MATCH(D172,EWEMs!$W$5:$W$24,0))","v":{"$error":"#N/A"}},"not bath","not kitchen",{"$error":"#VALUE!"},{"$f":"VLOOKUP(Observations!R172,EWEMs!$B$5:$D$24,3,FALSE)","v":{"$error":"#VALUE!"}}]
[null,null,{"$f":"IF(B173=\"\",\"\",INDEX('Units and Spaces'!C:C,MATCH(Observations!B173,'Units and Spaces'!B:B,0)))","v":""},null,null,"",null,null,null,null,null,"","",false,{"$f":"INDEX(EWEMs!$E$5:$E$24,MATCH(D173,EWEMs!$W$5:$W$24,0))","v":{"$error":"#N/A"}},"not bath","not kitchen",{"$error":"#VALUE!"},{"$f":"VLOOKUP(Observations!R173,EWEMs!$B$5:$D$24,3,FALSE)","v":{"$error":"#VALUE!"}}]
[null,null,{"$f":"IF(B174=\"\",\"\",INDEX('Units and Spaces'!C:C,MATCH(Observations!B174,'Units and Spaces'!B:B,0)))","v":""},null,null,"",null,null,null,null,null,"","",false,{"$f":"INDEX(EWEMs!$E$5:$E$24,MATCH(D174,EWEMs!$W$5:$W$24,0))","v":{"$error":"#N/A"}},"not bath","not kitchen",{"$error":"#VALUE!"},{"$f":"VLOOKUP(Observations!R174,EWEMs!$B$5:$D$24,3,FALSE)","v":{"$error":"#VALUE!"}}]
[null,null,{"$f":"IF(B175=\"\",\"\",INDEX('Units and Spaces'!C:C,MATCH(Observations!B175,'Units and Spaces'!B:B,0)))","v":""},null,null,"",null,null,null,null,null,"","",false,{"$f":"INDEX(EWEMs!$E$5:$E$24,MATCH(D175,EWEMs!$W$5:$W$24,0))","v":{"$error":"#N/A"}},"not bath","not kitchen",{"$error":"#VALUE!"},{"$f":"VLOOKUP(Observations!R175,EWEMs!$B$5:$D$24,3,FALSE)","v":{"$error":"#VALUE!"}}]
[null,null,{"$f":"IF(B176=\"\",\"\",INDEX('Units and Spaces'!C:C,MATCH(Observations!B176,'Units and Spaces'!B:B,0)))","v":""},null,null,"",null,null,null,null,null,"","",false,{"$f":"INDEX(EWEMs!$E$5:$E$24,MATCH(D176,EWEMs!$W$5:$W$24,0))","v":{"$error":"#N/A"}},"not bath","not kitchen",{"$error":"#VALUE!"},{"$f":"VLOOKUP(Observations!R176,EWEMs!$B$5:$D$24,3,FALSE)","v":{"$error":"#VALUE!"}}]
[null,null,{"$f":"IF(B177=\"\",\"\",INDEX('Units and Spaces'!C:C,MATCH(Observations!B177,'Units and Spaces'!B:B,0)))","v":""},null,null,"",null,null,null,null,null,"","",false,{"$f":"INDEX(EWEMs!$E$5:$E$24,MATCH(D177,EWEMs!$W$5:$W$24,0))","v":{"$error":"#N/A"}},"not bath","not kitchen",{"$error":"#VALUE!"},{"$f":"VLOOKUP(Observations!R177,EWEMs!$B$5:$D$24,3,FALSE)","v":{"$error":"#VALUE!"}}]
[null,null,{"$f":"IF(B178=\"\",\"\",INDEX('Units and Spaces'!C:C,MATCH(Observations!B178,'Units and Spaces'!B:B,0)))","v":""},null,null,"",null,null,null,null,null,"","",false,{"$f":"INDEX(EWEMs!$E$5:$E$24,MATCH(D178,EWEMs!$W$5:$W$24,0))","v":{"$error":"#N/A"}},"not bath","not kitchen",{"$error":"#VALUE!"},{"$f":"VLOOKUP(Observations!R178,EWEMs!$B$5:$D$24,3,FALSE)","v":{"$error":"#VALUE!"}}]
[null,null,{"$f":"IF(B179=\"\",\"\",INDEX('Units and Spaces'!C:C,MATCH(Observations!B179,'Units and Spaces'!B:B,0)))","v":""},null,null,"",null,null,null,null,null,"","",false,{"$f":"INDEX(EWEMs!$E$5:$E$24,MATCH(D179,EWEMs!$W$5:$W$24,0))","v":{"$error":"#N/A"}},"not bath","not kitchen",{"$error":"#VALUE!"},{"$f":"VLOOKUP(Observations!R179,EWEMs!$B$5:$D$24,3,FALSE)","v":{"$error":"#VALUE!"}}]
[null,null,{"$f":"IF(B180=\"\",\"\",INDEX('Units and Spaces'!C:C,MATCH(Observations!B180,'Units and Spaces'!B:B,0)))","v":""},null,null,"",null,null,null,null,null,"","",false,{"$f":"INDEX(EWEMs!$E$5:$E$24,MATCH(D180,EWEMs!$W$5:$W$24,0))","v":{"$error":"#N/A"}},"not bath","not kitchen",{"$error":"#VALUE!"},{"$f":"VLOOKUP(Observations!R180,EWEMs!$B$5:$D$24,3,FALSE)","v":{"$error":"#VALUE!"}}]
[null,null,{"$f":"IF(B181=\"\",\"\",INDEX('Units and Spaces'!C:C,MATCH(Observations!B181,'Units and Spaces'!B:B,0)))","v":""},null,null,"",null,null,null,null,null,"","",false,{"$f":"INDEX(EWEMs!$E$5:$E$24,MATCH(D181,EWEMs!$W$5:$W$24,0))","v":{"$error":"#N/A"}},"not bath","not kitchen",{"$error":"#VALUE!"},{"$f":"VLOOKUP(Observations!R181,EWEMs!$B$5:$D$24,3,FALSE)","v":{"$error":"#VALUE!"}}]
[null,null,{"$f":"IF(B182=\"\",\"\",INDEX('Units and Spaces'!C:C,MATCH(Observations!B182,'Units and Spaces'!B:B,0)))","v":""},null,null,"",null,null,null,null,null,"","",false,{"$f":"INDEX(EWEMs!$E$5:$E$24,MATCH(D182,EWEMs!$W$5:$W$24,0))","v":{"$error":"#N/A"}},"not bath","not kitchen",{"$error":"#VALUE!"},{"$f":"VLOOKUP(Observations!R182,EWEMs!$B$5:$D$24,3,FALSE)","v":{"$error":"#VALUE!"}}]
[null,null,{"$f":"IF(B183=\"\",\"\",INDEX('Units and Spaces'!C:C,MATCH(Observations!B183,'Units and Spaces'!B:B,0)))","v":""},null,null,"",null,null,null,null,null,"","",false,{"$f":"INDEX(EWEMs!$E$5:$E$24,MATCH(D183,EWEMs!$W$5:$W$24,0))","v":{"$error":"#N/A"}},"not bath","not kitchen",{"$error":"#VALUE!"},{"$f":"VLOOKUP(Observations!R183,EWEMs!$B$5:$D$24,3,FALSE)","v":{"$error":"#VALUE!"}}]
[null,null,{"$f":"IF(B184=\"\",\"\",INDEX('Units and Spaces'!C:C,MATCH(Observations!B184,'Units and Spaces'!B:B,0)))","v":""},null,null,"",null,null,null,null,null,"","",false,{"$f":"INDEX(EWEMs!$E$5:$E$24,MATCH(D184,EWEMs!$W$5:$W$24,0))","v":{"$error":"#N/A"}},"not bath","not kitchen",{"$error":"#VALUE!"},{"$f":"VLOOKUP(Observations!R184,EWEMs!$B$5:$D$24,3,FALSE)","v":{"$error":"#VALUE!"}}]
[null,null,{"$f":"IF(B185=\"\",\"\",INDEX('Units and Spaces'!C:C,MATCH(Observations!B185,'Units and Spaces'!B:B,0)))","v":""},null,null,"",null,null,null,null,null,"","",false,{"$f":"INDEX(EWEMs!$E$5:$E$24,MATCH(D185,EWEMs!$W$5:$W$24,0))","v":{"$error":"#N/A"}},"not bath","not kitchen",{"$error":"#VALUE!"},{"$f":"VLOOKUP(Observations!R185,EWEMs!$B$5:$D$24,3,FALSE)","v":{"$error":"#VALUE!"}}]
[null,null,{"$f":"IF(B186=\"\",\"\",INDEX('Units and Spaces'!C:C,MATCH(Observations!B186,'Units and Spaces'!B:B,0)))","v":""},null,null,"",null,null,null,null,null,"","",false,{"$f":"INDEX(EWEMs!$E$5:$E$24,MATCH(D186,EWEMs!$W$5:$W$24,0))","v":{"$error":"#N/A"}},"not bath","not kitchen",{"$error":"#VALUE!"},{"$f":"VLOOKUP(Observations!R186,EWEMs!$B$5:$D$24,3,FALSE)","v":{"$error":"#VALUE!"}}]
[null,null,{"$f":"IF(B187=\"\",\"\",INDEX('Units and Spaces'!C:C,MATCH(Observations!B187,'Units and Spaces'!B:B,0)))","v":""},null,null,"",null,null,null,null,null,"","",false,{"$f":"INDEX(EWEMs!$E$5:$E$24,MATCH(D187,EWEMs!$W$5:$W$24,0))","v":{"$error":"#N/A"}},"not bath","not kitchen",{"$error":"#VALUE!"},{"$f":"VLOOKUP(Observations!R187,EWEMs!$B$5:$D$24,3,FALSE)","v":{"$error":"#VALUE!"}}]
[null,null,{"$f":"IF(B188=\"\",\"\",INDEX('Units and Spaces'!C:C,MATCH(Observations!B188,'Units and Spaces'!B:B,0)))","v":""},null,null,"",null,null,null,null,null,"","",false,{"$f":"INDEX(EWEMs!$E$5:$E$24,MATCH(D188,EWEMs!$W$5:$W$24,0))","v":{"$error":"#N/A"}},"not bath","not kitchen",{"$error":"#VALUE!"},{"$f":"VLOOKUP(Observations!R188,EWEMs!$B$5:$D$24,3,FALSE)","v":{"$error":"#VALUE!"}}]
[null,null,{"$f":"IF(B189=\"\",\"\",INDEX('Units and Spaces'!C:C,MATCH(Observations!B189,'Units and Spaces'!B:B,0)))","v":""},null,null,"",null,null,null,null,null,"","",false,{"$f":"INDEX(EWEMs!$E$5:$E$24,MATCH(D189,EWEMs!$W$5:$W$24,0))","v":{"$error":"#N/A"}},"not bath","not kitchen",{"$error":"#VALUE!"},{"$f":"VLOOKUP(Observations!R189,EWEMs!$B$5:$D$24,3,FALSE)","v":{"$error":"#VALUE!"}}]
[null,null,{"$f":"IF(B190=\"\",\"\",INDEX('Units and Spaces'!C:C,MATCH(Observations!B190,'Units and Spaces'!B:B,0)))","v":""},null,null,"",null,null,null,null,null,"","",false,{"$f":"INDEX(EWEMs!$E$5:$E$24,MATCH(D190,EWEMs!$W$5:$W$24,0))","v":{"$error":"#N/A"}},"not bath","not kitchen",{"$error":"#VALUE!"},{"$f":"VLOOKUP(Observations!R190,EWEMs!$B$5:$D$24,3,FALSE)","v":{"$error":"#VALUE!"}}]
[null,null,{"$f":"IF(B191=\"\",\"\",INDEX('Units and Spaces'!C:C,MATCH(Observations!B191,'Units and Spaces'!B:B,0)))","v":""},null,null,"",null,null,null,null,null,"","",false,{"$f":"INDEX(EWEMs!$E$5:$E$24,MATCH(D191,EWEMs!$W$5:$W$24,0))","v":{"$error":"#N/A"}},"not bath","not kitchen",{"$error":"#VALUE!"},{"$f":"VLOOKUP(Observations!R191,EWEMs!$B$5:$D$24,3,FALSE)","v":{"$error":"#VALUE!"}}]
[null,null,{"$f":"IF(B192=\"\",\"\",INDEX('Units and Spaces'!C:C,MATCH(Observations!B192,'Units and Spaces'!B:B,0)))","v":""},null,null,"",null,null,null,null,null,"","",false,{"$f":"INDEX(EWEMs!$E$5:$E$24,MATCH(D192,EWEMs!$W$5:$W$24,0))","v":{"$error":"#N/A"}},"not bath","not kitchen",{"$error":"#VALUE!"},{"$f":"VLOOKUP(Observations!R192,EWEMs!$B$5:$D$24,3,FALSE)","v":{"$error":"#VALUE!"}}]
[null,null,{"$f":"IF(B193=\"\",\"\",INDEX('Units and Spaces'!C:C,MATCH(Observations!B193,'Units and Spaces'!B:B,0)))","v":""},null,null,"",null,null,null,null,null,"","",false,{"$f":"INDEX(EWEMs!$E$5:$E$24,MATCH(D193,EWEMs!$W$5:$W$24,0))","v":{"$error":"#N/A"}},"not bath","not kitchen",{"$error":"#VALUE!"},{"$f":"VLOOKUP(Observations!R193,EWEMs!$B$5:$D$24,3,FALSE)","v":{"$error":"#VALUE!"}}]
[null,null,{"$f":"IF(B194=\"\",\"\",INDEX('Units and Spaces'!C:C,MATCH(Observations!B194,'Units and Spaces'!B:B,0)))","v":""},null,null,"",null,null,null,null,null,"","",false,{"$f":"INDEX(EWEMs!$E$5:$E$24,MATCH(D194,EWEMs!$W$5:$W$24,0))","v":{"$error":"#N/A"}},"not bath","not kitchen",{"$error":"#VALUE!"},{"$f":"VLOOKUP(Observations!R194,EWEMs!$B$5:$D$24,3,FALSE)","v":{"$error":"#VALUE!"}}]
[null,null,{"$f":"IF(B195=\"\",\"\",INDEX('Units and Spaces'!C:C,MATCH(Observations!B195,'Units and Spaces'!B:B,0)))","v":""},null,null,"",null,null,null,null,null,"","",false,{"$f":"INDEX(EWEMs!$E$5:$E$24,MATCH(D195,EWEMs!$W$5:$W$24,0))","v":{"$error":"#N/A"}},"not bath","not kitchen",{"$error":"#VALUE!"},{"$f":"VLOOKUP(Observations!R195,EWEMs!$B$5:$D$24,3,FALSE)","v":{"$error":"#VALUE!"}}]
[null,null,{"$f":"IF(B196=\"\",\"\",INDEX('Units and Spaces'!C:C,MATCH(Observations!B196,'Units and Spaces'!B:B,0)))","v":""},null,null,"",null,null,null,null,null,"","",false,{"$f":"INDEX(EWEMs!$E$5:$E$24,MATCH(D196,EWEMs!$W$5:$W$24,0))","v":{"$error":"#N/A"}},"not bath","not kitchen",{"$error":"#VALUE!"},{"$f":"VLOOKUP(Observations!R196,EWEMs!$B$5:$D$24,3,FALSE)","v":{"$error":"#VALUE!"}}]
[null,null,{"$f":"IF(B197=\"\",\"\",INDEX('Units and Spaces'!C:C,MATCH(Observations!B197,'Units and Spaces'!B:B,0)))","v":""},null,null,"",null,null,null,null,null,"","",false,{"$f":"INDEX(EWEMs!$E$5:$E$24,MATCH(D197,EWEMs!$W$5:$W$24,0))","v":{"$error":"#N/A"}},"not bath","not kitchen",{"$error":"#VALUE!"},{"$f":"VLOOKUP(Observations!R197,EWEMs!$B$5:$D$24,3,FALSE)","v":{"$error":"#VALUE!"}}]
[null,null,{"$f":"IF(B198=\"\",\"\",INDEX('Units and Spaces'!C:C,MATCH(Observations!B198,'Units and Spaces'!B:B,0)))","v":""},null,null,"",null,null,null,null,null,"","",false,{"$f":"INDEX(EWEMs!$E$5:$E$24,MATCH(D198,EWEMs!$W$5:$W$24,0))","v":{"$error":"#N/A"}},"not bath","not kitchen",{"$error":"#VALUE!"},{"$f":"VLOOKUP(Observations!R198,EWEMs!$B$5:$D$24,3,FALSE)","v":{"$error":"#VALUE!"}}]
[null,null,{"$f":"IF(B199=\"\",\"\",INDEX('Units and Spaces'!C:C,MATCH(Observations!B199,'Units and Spaces'!B:B,0)))","v":""},null,null,"",null,null,null,null,null,"","",false,{"$f":"INDEX(EWEMs!$E$5:$E$24,MATCH(D199,EWEMs!$W$5:$W$24,0))","v":{"$error":"#N/A"}},"not bath","not kitchen",{"$error":"#VALUE!"},{"$f":"VLOOKUP(Observations!R199,EWEMs!$B$5:$D$24,3,FALSE)","v":{"$error":"#VALUE!"}}]
[null,null,{"$f":"IF(B200=\"\",\"\",INDEX('Units and Spaces'!C:C,MATCH(Observations!B200,'Units and Spaces'!B:B,0)))","v":""},null,null,{"$f":"IF(AND(N200=TRUE,E200<>\"\"), IF(ISNUMBER(SEARCH(\"compliant\", P200)),P200,IF(ISNUMBER(SEARCH(\"compliant\",Q200)),Q200,IF(E200<=O200,\"compliant\",\"noncompliant\"))),\"\")","v":""},null,null,null,null,null,{"$f":"IF(OR(F200=\"compliant\",F200=\"noncompliant\"),D200&F200,D200&G200)","v":""},{"$f":"IF(C200=\"Apartment\",IF(B200=0,\"\",B200),\"\")","v":""},{"$f":"IF(OR(ISNUMBER(FIND(\"low-flow\",D200,1)), ISNUMBER(FIND(\"low-flush\",D200,1))),TRUE,FALSE)","v":false},{"$f":"INDEX(EWEMs!$E$5:$E$24,MATCH(D200,EWEMs!$W$5:$W$24,0))","v":{"$error":"#N/A"}},{"$f":"IF(OR(ISNUMBER(SEARCH(\"bath faucets\", D200)), AND( ISNUMBER(SEARCH(\"fixture\", D200)),ISNUMBER(SEARCH(\"bath\", S200)) )), IF(O200<=1, IF(AND(E200>=O200, E200<=1), \"compliant\", \"noncompliant\"), IF(AND(E200>=1, E200<=O200),\"compliant\",\"noncompliant\")), \"not bath\"\n)","v":"not bath"},{"$f":"IF(OR(ISNUMBER(SEARCH(\"kitchen faucets\", D200)), AND(ISNUMBER(SEARCH(\"fixtures\", D200)),ISNUMBER(SEARCH(\"kitchen\", S200)) )), IF(O200<=1.5, IF(AND(E200>=O200, E200<=1.5), \"compliant\", \"noncompliant\"), IF(AND(E200>=1.5, E200<=O200),\"compliant\",\"noncompliant\")), \"not kitchen\"\n)","v":"not kitchen"},{"$f":"LEFT(D200,(FIND(\" \",D200,1)-1))*1","v":{"$error":"#VALUE!"}},{"$f":"VLOOKUP(Observations!R200,EWEMs!$B$5:$D$24,3,FALSE)","v":{"$error":"#VALUE!"}}]
[null,null,{"$f":"IF(B201=\"\",\"\",INDEX('Units and Spaces'!C:C,MATCH(Observations!B201,'Units and Spaces'!B:B,0)))","v":""},null,null,"",null,null,null,null,null,"","",false,{"$f":"INDEX(EWEMs!$E$5:$E$24,MATCH(D201,EWEMs!$W$5:$W$24,0))","v":{"$error":"#N/A"}},"not bath","not kitchen",{"$error":"#VALUE!"},{"$f":"VLOOKUP(Observations!R201,EWEMs!$B$5:$D$24,3,FALSE)","v":{"$error":"#VALUE!"}}]
[null,null,{"$f":"IF(B202=\"\",\"\",INDEX('Units and Spaces'!C:C,MATCH(Observations!B202,'Units and Spaces'!B:B,0)))","v":""},null,null,"",null,null,null,null,null,"","",false,{"$f":"INDEX(EWEMs!$E$5:$E$24,MATCH(D202,EWEMs!$W$5:$W$24,0))","v":{"$error":"#N/A"}},"not bath","not kitchen",{"$error":"#VALUE!"},{"$f":"VLOOKUP(Observations!R202,EWEMs!$B$5:$D$24,3,FALSE)","v":{"$error":"#VALUE!"}}]
[null,null,{"$f":"IF(B203=\"\",\"\",INDEX('Units and Spaces'!C:C,MATCH(Observations!B203,'Units and Spaces'!B:B,0)))","v":""},null,null,"",null,null,null,null,null,"","",false,{"$f":"INDEX(EWEMs!$E$5:$E$24,MATCH(D203,EWEMs!$W$5:$W$24,0))","v":{"$error":"#N/A"}},"not bath","not kitchen",{"$error":"#VALUE!"},{"$f":"VLOOKUP(Observations!R203,EWEMs!$B$5:$D$24,3,FALSE)","v":{"$error":"#VALUE!"}}]
[null,null,{"$f":"IF(B204=\"\",\"\",INDEX('Units and Spaces'!C:C,MATCH(Observations!B204,'Units and Spaces'!B:B,0)))","v":""},null,null,"",null,null,null,null,null,"","",false,{"$f":"INDEX(EWEMs!$E$5:$E$24,MATCH(D204,EWEMs!$W$5:$W$24,0))","v":{"$error":"#N/A"}},"not bath","not kitchen",{"$error":"#VALUE!"},{"$f":"VLOOKUP(Observations!R204,EWEMs!$B$5:$D$24,3,FALSE)","v":{"$error":"#VALUE!"}}]
[null,null,{"$f":"IF(B205=\"\",\"\",INDEX('Units and Spaces'!C:C,MATCH(Observations!B205,'Units and Spaces'!B:B,0)))","v":""},null,null,"",null,null,null,null,null,"","",false,{"$f":"INDEX(EWEMs!$E$5:$E$24,MATCH(D205,EWEMs!$W$5:$W$24,0))","v":{"$error":"#N/A"}},"not bath","not kitchen",{"$error":"#VALUE!"},{"$f":"VLOOKUP(Observations!R205,EWEMs!$B$5:$D$24,3,FALSE)","v":{"$error":"#VALUE!"}}]
[null,null,{"$f":"IF(B206=\"\",\"\",INDEX('Units and Spaces'!C:C,MATCH(Observations!B206,'Units and Spaces'!B:B,0)))","v":""},null,null,"",null,null,null,null,null,"","",false,{"$f":"INDEX(EWEMs!$E$5:$E$24,MATCH(D206,EWEMs!$W$5:$W$24,0))","v":{"$error":"#N/A"}},"not bath","not kitchen",{"$error":"#VALUE!"},{"$f":"VLOOKUP(Observations!R206,EWEMs!$B$5:$D$24,3,FALSE)","v":{"$error":"#VALUE!"}}]
[null,null,{"$f":"IF(B207=\"\",\"\",INDEX('Units and Spaces'!C:C,MATCH(Observations!B207,'Units and Spaces'!B:B,0)))","v":""},null,null,"",null,null,null,null,null,"","",false,{"$f":"INDEX(EWEMs!$E$5:$E$24,MATCH(D207,EWEMs!$W$5:$W$24,0))","v":{"$error":"#N/A"}},"not bath","not kitchen",{"$error":"#VALUE!"},{"$f":"VLOOKUP(Observations!R207,EWEMs!$B$5:$D$24,3,FALSE)","v":{"$error":"#VALUE!"}}]
[null,null,{"$f":"IF(B208=\"\",\"\",INDEX('Units and Spaces'!C:C,MATCH(Observations!B208,'Units and Spaces'!B:B,0)))","v":""},null,null,"",null,null,null,null,null,"","",false,{"$f":"INDEX(EWEMs!$E$5:$E$24,MATCH(D208,EWEMs!$W$5:$W$24,0))","v":{"$error":"#N/A"}},"not bath","not kitchen",{"$error":"#VALUE!"},{"$f":"VLOOKUP(Observations!R208,EWEMs!$B$5:$D$24,3,FALSE)","v":{"$error":"#VALUE!"}}]
[null,null,{"$f":"IF(B209=\"\",\"\",INDEX('Units and Spaces'!C:C,MATCH(Observations!B209,'Units and Spaces'!B:B,0)))","v":""},null,null,"",null,null,null,null,null,"","",false,{"$f":"INDEX(EWEMs!$E$5:$E$24,MATCH(D209,EWEMs!$W$5:$W$24,0))","v":{"$error":"#N/A"}},"not bath","not kitchen",{"$error":"#VALUE!"},{"$f":"VLOOKUP(Observations!R209,EWEMs!$B$5:$D$24,3,FALSE)","v":{"$error":"#VALUE!"}}]
[null,null,{"$f":"IF(B210=\"\",\"\",INDEX('Units and Spaces'!C:C,MATCH(Observations!B210,'Units and Spaces'!B:B,0)))","v":""},null,null,"",null,null,null,null,null,"","",false,{"$f":"INDEX(EWEMs!$E$5:$E$24,MATCH(D210,EWEMs!$W$5:$W$24,0))","v":{"$error":"#N/A"}},"not bath","not kitchen",{"$error":"#VALUE!"},{"$f":"VLOOKUP(Observations!R210,EWEMs!$B$5:$D$24,3,FALSE)","v":{"$error":"#VALUE!"}}]
[null,null,{"$f":"IF(B211=\"\",\"\",INDEX('Units and Spaces'!C:C,MATCH(Observations!B211,'Units and Spaces'!B:B,0)))","v":""},null,null,"",null,null,null,null,null,"","",false,{"$f":"INDEX(EWEMs!$E$5:$E$24,MATCH(D211,EWEMs!$W$5:$W$24,0))","v":{"$error":"#N/A"}},"not bath","not kitchen",{"$error":"#VALUE!"},{"$f":"VLOOKUP(Observations!R211,EWEMs!$B$5:$D$24,3,FALSE)","v":{"$error":"#VALUE!"}}]
[null,null,{"$f":"IF(B212=\"\",\"\",INDEX('Units and Spaces'!C:C,MATCH(Observations!B212,'Units and Spaces'!B:B,0)))","v":""},null,null,"",null,null,null,null,null,"","",false,{"$f":"INDEX(EWEMs!$E$5:$E$24,MATCH(D212,EWEMs!$W$5:$W$24,0))","v":{"$error":"#N/A"}},"not bath","not kitchen",{"$error":"#VALUE!"},{"$f":"VLOOKUP(Observations!R212,EWEMs!$B$5:$D$24,3,FALSE)","v":{"$error":"#VALUE!"}}]
[null,null,{"$f":"IF(B213=\"\",\"\",INDEX('Units and Spaces'!C:C,MATCH(Observations!B213,'Units and Spaces'!B:B,0)))","v":""},null,null,"",null,null,null,null,null,"","",false,{"$f":"INDEX(EWEMs!$E$5:$E$24,MATCH(D213,EWEMs!$W$5:$W$24,0))","v":{"$error":"#N/A"}},"not bath","not kitchen",{"$error":"#VALUE!"},{"$f":"VLOOKUP(Observations!R213,EWEMs!$B$5:$D$24,3,FALSE)","v":{"$error":"#VALUE!"}}]
[null,null,{"$f":"IF(B214=\"\",\"\",INDEX('Units and Spaces'!C:C,MATCH(Observations!B214,'Units and Spaces'!B:B,0)))","v":""},null,null,"",null,null,null,null,null,"","",false,{"$f":"INDEX(EWEMs!$E$5:$E$24,MATCH(D214,EWEMs!$W$5:$W$24,0))","v":{"$error":"#N/A"}},"not bath","not kitchen",{"$error":"#VALUE!"},{"$f":"VLOOKUP(Observations!R214,EWEMs!$B$5:$D$24,3,FALSE)","v":{"$error":"#VALUE!"}}]
[null,null,{"$f":"IF(B215=\"\",\"\",INDEX('Units and Spaces'!C:C,MATCH(Observations!B215,'Units and Spaces'!B:B,0)))","v":""},null,null,"",null,null,null,null,null,"","",false,{"$f":"INDEX(EWEMs!$E$5:$E$24,MATCH(D215,EWEMs!$W$5:$W$24,0))","v":{"$error":"#N/A"}},"not bath","not kitchen",{"$error":"#VALUE!"},{"$f":"VLOOKUP(Observations!R215,EWEMs!$B$5:$D$24,3,FALSE)","v":{"$error":"#VALUE!"}}]
[null,null,{"$f":"IF(B216=\"\",\"\",INDEX('Units and Spaces'!C:C,MATCH(Observations!B216,'Units and Spaces'!B:B,0)))","v":""},null,null,"",null,null,null,null,null,"","",false,{"$f":"INDEX(EWEMs!$E$5:$E$24,MATCH(D216,EWEMs!$W$5:$W$24,0))","v":{"$error":"#N/A"}},"not bath","not kitchen",{"$error":"#VALUE!"},{"$f":"VLOOKUP(Observations!R216,EWEMs!$B$5:$D$24,3,FALSE)","v":{"$error":"#VALUE!"}}]
[null,null,{"$f":"IF(B217=\"\",\"\",INDEX('Units and Spaces'!C:C,MATCH(Observations!B217,'Units and Spaces'!B:B,0)))","v":""},null,null,"",null,null,null,null,null,"","",false,{"$f":"INDEX(EWEMs!$E$5:$E$24,MATCH(D217,EWEMs!$W$5:$W$24,0))","v":{"$error":"#N/A"}},"not bath","not kitchen",{"$error":"#VALUE!"},{"$f":"VLOOKUP(Observations!R217,EWEMs!$B$5:$D$24,3,FALSE)","v":{"$error":"#VALUE!"}}]
[null,null,{"$f":"IF(B218=\"\",\"\",INDEX('Units and Spaces'!C:C,MATCH(Observations!B218,'Units and Spaces'!B:B,0)))","v":""},null,null,"",null,null,null,null,null,"","",false,{"$f":"INDEX(EWEMs!$E$5:$E$24,MATCH(D218,EWEMs!$W$5:$W$24,0))","v":{"$error":"#N/A"}},"not bath","not kitchen",{"$error":"#VALUE!"},{"$f":"VLOOKUP(Observations!R218,EWEMs!$B$5:$D$24,3,FALSE)","v":{"$error":"#VALUE!"}}]
[null,null,{"$f":"IF(B219=\"\",\"\",INDEX('Units and Spaces'!C:C,MATCH(Observations!B219,'Units and Spaces'!B:B,0)))","v":""},null,null,"",null,null,null,null,null,"","",false,{"$f":"INDEX(EWEMs!$E$5:$E$24,MATCH(D219,EWEMs!$W$5:$W$24,0))","v":{"$error":"#N/A"}},"not bath","not kitchen",{"$error":"#VALUE!"},{"$f":"VLOOKUP(Observations!R219,EWEMs!$B$5:$D$24,3,FALSE)","v":{"$error":"#VALUE!"}}]
[null,null,{"$f":"IF(B220=\"\",\"\",INDEX('Units and Spaces'!C:C,MATCH(Observations!B220,'Units and Spaces'!B:B,0)))","v":""},null,null,"",null,null,null,null,null,"","",false,{"$f":"INDEX(EWEMs!$E$5:$E$24,MATCH(D220,EWEMs!$W$5:$W$24,0))","v":{"$error":"#N/A"}},"not bath","not kitchen",{"$error":"#VALUE!"},{"$f":"VLOOKUP(Observations!R220,EWEMs!$B$5:$D$24,3,FALSE)","v":{"$error":"#VALUE!"}}]
[null,null,{"$f":"IF(B221=\"\",\"\",INDEX('Units and Spaces'!C:C,MATCH(Observations!B221,'Units and Spaces'!B:B,0)))","v":""},null,null,"",null,null,null,null,null,"","",false,{"$f":"INDEX(EWEMs!$E$5:$E$24,MATCH(D221,EWEMs!$W$5:$W$24,0))","v":{"$error":"#N/A"}},"not bath","not kitchen",{"$error":"#VALUE!"},{"$f":"VLOOKUP(Observations!R221,EWEMs!$B$5:$D$24,3,FALSE)","v":{"$error":"#VALUE!"}}]
[null,null,{"$f":"IF(B222=\"\",\"\",INDEX('Units and Spaces'!C:C,MATCH(Observations!B222,'Units and Spaces'!B:B,0)))","v":""},null,null,"",null,null,null,null,null,"","",false,{"$f":"INDEX(EWEMs!$E$5:$E$24,MATCH(D222,EWEMs!$W$5:$W$24,0))","v":{"$error":"#N/A"}},"not bath","not kitchen",{"$error":"#VALUE!"},{"$f":"VLOOKUP(Observations!R222,EWEMs!$B$5:$D$24,3,FALSE)","v":{"$error":"#VALUE!"}}]
[null,null,{"$f":"IF(B223=\"\",\"\",INDEX('Units and Spaces'!C:C,MATCH(Observations!B223,'Units and Spaces'!B:B,0)))","v":""},null,null,"",null,null,null,null,null,"","",false,{"$f":"INDEX(EWEMs!$E$5:$E$24,MATCH(D223,EWEMs!$W$5:$W$24,0))","v":{"$error":"#N/A"}},"not bath","not kitchen",{"$error":"#VALUE!"},{"$f":"VLOOKUP(Observations!R223,EWEMs!$B$5:$D$24,3,FALSE)","v":{"$error":"#VALUE!"}}]
[null,null,{"$f":"IF(B224=\"\",\"\",INDEX('Units and Spaces'!C:C,MATCH(Observations!B224,'Units and Spaces'!B:B,0)))","v":""},null,null,"",null,null,null,null,null,"","",false,{"$f":"INDEX(EWEMs!$E$5:$E$24,MATCH(D224,EWEMs!$W$5:$W$24,0))","v":{"$error":"#N/A"}},"not bath","not kitchen",{"$error":"#VALUE!"},{"$f":"VLOOKUP(Observations!R224,EWEMs!$B$5:$D$24,3,FALSE)","v":{"$error":"#VALUE!"}}]
[null,null,{"$f":"IF(B225=\"\",\"\",INDEX('Units and Spaces'!C:C,MATCH(Observations!B225,'Units and Spaces'!B:B,0)))","v":""},null,null,"",null,null,null,null,null,"","",false,{"$f":"INDEX(EWEMs!$E$5:$E$24,MATCH(D225,EWEMs!$W$5:$W$24,0))","v":{"$error":"#N/A"}},"not bath","not kitchen",{"$error":"#VALUE!"},{"$f":"VLOOKUP(Observations!R225,EWEMs!$B$5:$D$24,3,FALSE)","v":{"$error":"#VALUE!"}}]
[null,null,{"$f":"IF(B226=\"\",\"\",INDEX('Units and Spaces'!C:C,MATCH(Observations!B226,'Units and Spaces'!B:B,0)))","v":""},null,null,"",null,null,null,null,null,"","",false,{"$f":"INDEX(EWEMs!$E$5:$E$24,MATCH(D226,EWEMs!$W$5:$W$24,0))","v":{"$error":"#N/A"}},"not bath","not kitchen",{"$error":"#VALUE!"},{"$f":"VLOOKUP(Observations!R226,EWEMs!$B$5:$D$24,3,FALSE)","v":{"$error":"#VALUE!"}}]
[null,null,{"$f":"IF(B227=\"\",\"\",INDEX('Units and Spaces'!C:C,MATCH(Observations!B227,'Units and Spaces'!B:B,0)))","v":""},null,null,"",null,null,null,null,null,"","",false,{"$f":"INDEX(EWEMs!$E$5:$E$24,MATCH(D227,EWEMs!$W$5:$W$24,0))","v":{"$error":"#N/A"}},"not bath","not kitchen",{"$error":"#VALUE!"},{"$f":"VLOOKUP(Observations!R227,EWEMs!$B$5:$D$24,3,FALSE)","v":{"$error":"#VALUE!"}}]
[null,null,{"$f":"IF(B228=\"\",\"\",INDEX('Units and Spaces'!C:C,MATCH(Observations!B228,'Units and Spaces'!B:B,0)))","v":""},null,null,"",null,null,null,null,null,"","",false,{"$f":"INDEX(EWEMs!$E$5:$E$24,MATCH(D228,EWEMs!$W$5:$W$24,0))","v":{"$error":"#N/A"}},"not bath","not kitchen",{"$error":"#VALUE!"},{"$f":"VLOOKUP(Observations!R228,EWEMs!$B$5:$D$24,3,FALSE)","v":{"$error":"#VALUE!"}}]
[null,null,{"$f":"IF(B229=\"\",\"\",INDEX('Units and Spaces'!C:C,MATCH(Observations!B229,'Units and Spaces'!B:B,0)))","v":""},null,null,"",null,null,null,null,null,"","",false,{"$f":"INDEX(EWEMs!$E$5:$E$24,MATCH(D229,EWEMs!$W$5:$W$24,0))","v":{"$error":"#N/A"}},"not bath","not kitchen",{"$error":"#VALUE!"},{"$f":"VLOOKUP(Observations!R229,EWEMs!$B$5:$D$24,3,FALSE)","v":{"$error":"#VALUE!"}}]
[null,null,{"$f":"IF(B230=\"\",\"\",INDEX('Units and Spaces'!C:C,MATCH(Observations!B230,'Units and Spaces'!B:B,0)))","v":""},null,null,"",null,null,null,null,null,"","",false,{"$f":"INDEX(EWEMs!$E$5:$E$24,MATCH(D230,EWEMs!$W$5:$W$24,0))","v":{"$error":"#N/A"}},"not bath","not kitchen",{"$error":"#VALUE!"},{"$f":"VLOOKUP(Observations!R230,EWEMs!$B$5:$D$24,3,FALSE)","v":{"$error":"#VALUE!"}}]
[null,null,{"$f":"IF(B231=\"\",\"\",INDEX('Units and Spaces'!C:C,MATCH(Observations!B231,'Units and Spaces'!B:B,0)))","v":""},null,null,"",null,null,null,null,null,"","",false,{"$f":"INDEX(EWEMs!$E$5:$E$24,MATCH(D231,EWEMs!$W$5:$W$24,0))","v":{"$error":"#N/A"}},"not bath","not kitchen",{"$error":"#VALUE!"},{"$f":"VLOOKUP(Observations!R231,EWEMs!$B$5:$D$24,3,FALSE)","v":{"$error":"#VALUE!"}}]
[null,null,{"$f":"IF(B232=\"\",\"\",INDEX('Units and Spaces'!C:C,MATCH(Observations!B232,'Units and Spaces'!B:B,0)))","v":""},null,null,"",null,null,null,null,null,"","",false,{"$f":"INDEX(EWEMs!$E$5:$E$24,MATCH(D232,EWEMs!$W$5:$W$24,0))","v":{"$error":"#N/A"}},"not bath","not kitchen",{"$error":"#VALUE!"},{"$f":"VLOOKUP(Observations!R232,EWEMs!$B$5:$D$24,3,FALSE)","v":{"$error":"#VALUE!"}}]
[null,null,{"$f":"IF(B233=\"\",\"\",INDEX('Units and Spaces'!C:C,MATCH(Observations!B233,'Units and Spaces'!B:B,0)))","v":""},null,null,"",null,null,null,null,null,"","",false,{"$f":"INDEX(EWEMs!$E$5:$E$24,MATCH(D233,EWEMs!$W$5:$W$24,0))","v":{"$error":"#N/A"}},"not bath","not kitchen",{"$error":"#VALUE!"},{"$f":"VLOOKUP(Observations!R233,EWEMs!$B$5:$D$24,3,FALSE)","v":{"$error":"#VALUE!"}}]
[null,null,{"$f":"IF(B234=\"\",\"\",INDEX('Units and Spaces'!C:C,MATCH(Observations!B234,'Units and Spaces'!B:B,0)))","v":""},null,null,"",null,null,null,null,null,"","",false,{"$f":"INDEX(EWEMs!$E$5:$E$24,MATCH(D234,EWEMs!$W$5:$W$24,0))","v":{"$error":"#N/A"}},"not bath","not kitchen",{"$error":"#VALUE!"},{"$f":"VLOOKUP(Observations!R234,EWEMs!$B$5:$D$24,3,FALSE)","v":{"$error":"#VALUE!"}}]
[null,null,{"$f":"IF(B235=\"\",\"\",INDEX('Units and Spaces'!C:C,MATCH(Observations!B235,'Units and Spaces'!B:B,0)))","v":""},null,null,"",null,null,null,null,null,"","",false,{"$f":"INDEX(EWEMs!$E$5:$E$24,MATCH(D235,EWEMs!$W$5:$W$24,0))","v":{"$error":"#N/A"}},"not bath","not kitchen",{"$error":"#VALUE!"},{"$f":"VLOOKUP(Observations!R235,EWEMs!$B$5:$D$24,3,FALSE)","v":{"$error":"#VALUE!"}}]
[null,null,{"$f":"IF(B236=\"\",\"\",INDEX('Units and Spaces'!C:C,MATCH(Observations!B236,'Units and Spaces'!B:B,0)))","v":""},null,null,"",null,null,null,null,null,"","",false,{"$f":"INDEX(EWEMs!$E$5:$E$24,MATCH(D236,EWEMs!$W$5:$W$24,0))","v":{"$error":"#N/A"}},"not bath","not kitchen",{"$error":"#VALUE!"},{"$f":"VLOOKUP(Observations!R236,EWEMs!$B$5:$D$24,3,FALSE)","v":{"$error":"#VALUE!"}}]
[null,null,{"$f":"IF(B237=\"\",\"\",INDEX('Units and Spaces'!C:C,MATCH(Observations!B237,'Units and Spaces'!B:B,0)))","v":""},null,null,"",null,null,null,null,null,"","",false,{"$f":"INDEX(EWEMs!$E$5:$E$24,MATCH(D237,EWEMs!$W$5:$W$24,0))","v":{"$error":"#N/A"}},"not bath","not kitchen",{"$error":"#VALUE!"},{"$f":"VLOOKUP(Observations!R237,EWEMs!$B$5:$D$24,3,FALSE)","v":{"$error":"#VALUE!"}}]
[null,null,{"$f":"IF(B238=\"\",\"\",INDEX('Units and Spaces'!C:C,MATCH(Observations!B238,'Units and Spaces'!B:B,0)))","v":""},null,null,"",null,null,null,null,null,"","",false,{"$f":"INDEX(EWEMs!$E$5:$E$24,MATCH(D238,EWEMs!$W$5:$W$24,0))","v":{"$error":"#N/A"}},"not bath","not kitchen",{"$error":"#VALUE!"},{"$f":"VLOOKUP(Observations!R238,EWEMs!$B$5:$D$24,3,FALSE)","v":{"$error":"#VALUE!"}}]
[null,null,{"$f":"IF(B239=\"\",\"\",INDEX('Units and Spaces'!C:C,MATCH(Observations!B239,'Units and Spaces'!B:B,0)))","v":""},null,null,"",null,null,null,null,null,"","",false,{"$f":"INDEX(EWEMs!$E$5:$E$24,MATCH(D239,EWEMs!$W$5:$W$24,0))","v":{"$error":"#N/A"}},"not bath","not kitchen",{"$error":"#VALUE!"},{"$f":"VLOOKUP(Observations!R239,EWEMs!$B$5:$D$24,3,FALSE)","v":{"$error":"#VALUE!"}}]
[null,null,{"$f":"IF(B240=\"\",\"\",INDEX('Units and Spaces'!C:C,MATCH(Observations!B240,'Units and Spaces'!B:B,0)))","v":""},null,null,"",null,null,null,null,null,"","",false,{"$f":"INDEX(EWEMs!$E$5:$E$24,MATCH(D240,EWEMs!$W$5:$W$24,0))","v":{"$error":"#N/A"}},"not bath","not kitchen",{"$error":"#VALUE!"},{"$f":"VLOOKUP(Observations!R240,EWEMs!$B$5:$D$24,3,FALSE)","v":{"$error":"#VALUE!"}}]
[null,null,{"$f":"IF(B241=\"\",\"\",INDEX('Units and Spaces'!C:C,MATCH(Observations!B241,'Units and Spaces'!B:B,0)))","v":""},null,null,"",null,null,null,null,null,"","",false,{"$f":"INDEX(EWEMs!$E$5:$E$24,MATCH(D241,EWEMs!$W$5:$W$24,0))","v":{"$error":"#N/A"}},"not bath","not kitchen",{"$error":"#VALUE!"},{"$f":"VLOOKUP(Observations!R241,EWEMs!$B$5:$D$24,3,FALSE)","v":{"$error":"#VALUE!"}}]
[null,null,{"$f":"IF(B242=\"\",\"\",INDEX('Units and Spaces'!C:C,MATCH(Observations!B242,'Units and Spaces'!B:B,0)))","v":""},null,null,"",null,null,null,null,null,"","",false,{"$f":"INDEX(EWEMs!$E$5:$E$24,MATCH(D242,EWEMs!$W$5:$W$24,0))","v":{"$error":"#N/A"}},"not bath","not kitchen",{"$error":"#VALUE!"},{"$f":"VLOOKUP(Observations!R242,EWEMs!$B$5:$D$24,3,FALSE)","v":{"$error":"#VALUE!"}}]
[null,null,{"$f":"IF(B243=\"\",\"\",INDEX('Units and Spaces'!C:C,MATCH(Observations!B243,'Units and Spaces'!B:B,0)))","v":""},null,null,"",null,null,null,null,null,"","",false,{"$f":"INDEX(EWEMs!$E$5:$E$24,MATCH(D243,EWEMs!$W$5:$W$24,0))","v":{"$error":"#N/A"}},"not bath","not kitchen",{"$error":"#VALUE!"},{"$f":"VLOOKUP(Observations!R243,EWEMs!$B$5:$D$24,3,FALSE)","v":{"$error":"#VALUE!"}}]
[null,null,{"$f":"IF(B244=\"\",\"\",INDEX('Units and Spaces'!C:C,MATCH(Observations!B244,'Units and Spaces'!B:B,0)))","v":""},null,null,"",null,null,null,null,null,"","",false,{"$f":"INDEX(EWEMs!$E$5:$E$24,MATCH(D244,EWEMs!$W$5:$W$24,0))","v":{"$error":"#N/A"}},"not bath","not kitchen",{"$error":"#VALUE!"},{"$f":"VLOOKUP(Observations!R244,EWEMs!$B$5:$D$24,3,FALSE)","v":{"$error":"#VALUE!"}}]
[null,null,{"$f":"IF(B245=\"\",\"\",INDEX('Units and Spaces'!C:C,MATCH(Observations!B245,'Units and Spaces'!B:B,0)))","v":""},null,null,"",null,null,null,null,null,"","",false,{"$f":"INDEX(EWEMs!$E$5:$E$24,MATCH(D245,EWEMs!$W$5:$W$24,0))","v":{"$error":"#N/A"}},"not bath","not kitchen",{"$error":"#VALUE!"},{"$f":"VLOOKUP(Observations!R245,EWEMs!$B$5:$D$24,3,FALSE)","v":{"$error":"#VALUE!"}}]
[null,null,{"$f":"IF(B246=\"\",\"\",INDEX('Units and Spaces'!C:C,MATCH(Observations!B246,'Units and Spaces'!B:B,0)))","v":""},null,null,"",null,null,null,null,null,"","",false,{"$f":"INDEX(EWEMs!$E$5:$E$24,MATCH(D246,EWEMs!$W$5:$W$24,0))","v":{"$error":"#N/A"}},"not bath","not kitchen",{"$error":"#VALUE!"},{"$f":"VLOOKUP(Observations!R246,EWEMs!$B$5:$D$24,3,FALSE)","v":{"$error":"#VALUE!"}}]
[null,null,{"$f":"IF(B247=\"\",\"\",INDEX('Units and Spaces'!C:C,MATCH(Observations!B247,'Units and Spaces'!B:B,0)))","v":""},null,null,"",null,null,null,null,null,"","",false,{"$f":"INDEX(EWEMs!$E$5:$E$24,MATCH(D247,EWEMs!$W$5:$W$24,0))","v":{"$error":"#N/A"}},"not bath","not kitchen",{"$error":"#VALUE!"},{"$f":"VLOOKUP(Observations!R247,EWEMs!$B$5:$D$24,3,FALSE)","v":{"$error":"#VALUE!"}}]
[null,null,{"$f":"IF(B248=\"\",\"\",INDEX('Units and Spaces'!C:C,MATCH(Observations!B248,'Units and Spaces'!B:B,0)))","v":""},null,null,"",null,null,null,null,null,"","",false,{"$f":"INDEX(EWEMs!$E$5:$E$24,MATCH(D248,EWEMs!$W$5:$W$24,0))","v":{"$error":"#N/A"}},"not bath","not kitchen",{"$error":"#VALUE!"},{"$f":"VLOOKUP(Observations!R248,EWEMs!$B$5:$D$24,3,FALSE)","v":{"$error":"#VALUE!"}}]
[null,null,{"$f":"IF(B249=\"\",\"\",INDEX('Units and Spaces'!C:C,MATCH(Observations!B249,'Units and Spaces'!B:B,0)))","v":""},null,null,"",null,null,null,null,null,"","",false,{"$f":"INDEX(EWEMs!$E$5:$E$24,MATCH(D249,EWEMs!$W$5:$W$24,0))","v":{"$error":"#N/A"}},"not bath","not kitchen",{"$error":"#VALUE!"},{"$f":"VLOOKUP(Observations!R249,EWEMs!$B$5:$D$24,3,FALSE)","v":{"$error":"#VALUE!"}}]
[null,null,{"$f":"IF(B250=\"\",\"\",INDEX('Units and Spaces'!C:C,MATCH(Observations!B250,'Units and Spaces'!B:B,0)))","v":""},null,null,"",null,null,null,null,null,"","",false,{"$f":"INDEX(EWEMs!$E$5:$E$24,MATCH(D250,EWEMs!$W$5:$W$24,0))","v":{"$error":"#N/A"}},"not bath","not kitchen",{"$error":"#VALUE!"},{"$f":"VLOOKUP(Observations!R250,EWEMs!$B$5:$D$24,3,FALSE)","v":{"$error":"#VALUE!"}}]
[null,null,{"$f":"IF(B251=\"\",\"\",INDEX('Units and Spaces'!C:C,MATCH(Observations!B251,'Units and Spaces'!B:B,0)))","v":""},null,null,"",null,null,null,null,null,"","",false,{"$f":"INDEX(EWEMs!$E$5:$E$24,MATCH(D251,EWEMs!$W$5:$W$24,0))","v":{"$error":"#N/A"}},"not bath","not kitchen",{"$error":"#VALUE!"},{"$f":"VLOOKUP(Observations!R251,EWEMs!$B$5:$D$24,3,FALSE)","v":{"$error":"#VALUE!"}}]
[null,null,{"$f":"IF(B252=\"\",\"\",INDEX('Units and Spaces'!C:C,MATCH(Observations!B252,'Units and Spaces'!B:B,0)))","v":""},null,null,"",null,null,null,null,null,"","",false,{"$f":"INDEX(EWEMs!$E$5:$E$24,MATCH(D252,EWEMs!$W$5:$W$24,0))","v":{"$error":"#N/A"}},"not bath","not kitchen",{"$error":"#VALUE!"},{"$f":"VLOOKUP(Observations!R252,EWEMs!$B$5:$D$24,3,FALSE)","v":{"$error":"#VALUE!"}}]
[null,null,{"$f":"IF(B253=\"\",\"\",INDEX('Units and Spaces'!C:C,MATCH(Observations!B253,'Units and Spaces'!B:B,0)))","v":""},null,null,"",null,null,null,null,null,"","",false,{"$f":"INDEX(EWEMs!$E$5:$E$24,MATCH(D253,EWEMs!$W$5:$W$24,0))","v":{"$error":"#N/A"}},"not bath","not kitchen",{"$error":"#VALUE!"},{"$f":"VLOOKUP(Observations!R253,EWEMs!$B$5:$D$24,3,FALSE)","v":{"$error":"#VALUE!"}}]
[null,null,{"$f":"IF(B254=\"\",\"\",INDEX('Units and Spaces'!C:C,MATCH(Observations!B254,'Units and Spaces'!B:B,0)))","v":""},null,null,"",null,null,null,null,null,"","",false,{"$f":"INDEX(EWEMs!$E$5:$E$24,MATCH(D254,EWEMs!$W$5:$W$24,0))","v":{"$error":"#N/A"}},"not bath","not kitchen",{"$error":"#VALUE!"},{"$f":"VLOOKUP(Observations!R254,EWEMs!$B$5:$D$24,3,FALSE)","v":{"$error":"#VALUE!"}}]
[null,null,{"$f":"IF(B255=\"\",\"\",INDEX('Units and Spaces'!C:C,MATCH(Observations!B255,'Units and Spaces'!B:B,0)))","v":""},null,null,"",null,null,null,null,null,"","",false,{"$f":"INDEX(EWEMs!$E$5:$E$24,MATCH(D255,EWEMs!$W$5:$W$24,0))","v":{"$error":"#N/A"}},"not bath","not kitchen",{"$error":"#VALUE!"},{"$f":"VLOOKUP(Observations!R255,EWEMs!$B$5:$D$24,3,FALSE)","v":{"$error":"#VALUE!"}}]
[null,null,{"$f":"IF(B256=\"\",\"\",INDEX('Units and Spaces'!C:C,MATCH(Observations!B256,'Units and Spaces'!B:B,0)))","v":""},null,null,"",null,null,null,null,null,"","",false,{"$f":"INDEX(EWEMs!$E$5:$E$24,MATCH(D256,EWEMs!$W$5:$W$24,0))","v":{"$error":"#N/A"}},"not bath","not kitchen",{"$error":"#VALUE!"},{"$f":"VLOOKUP(Observations!R256,EWEMs!$B$5:$D$24,3,FALSE)","v":{"$error":"#VALUE!"}}]
[null,null,{"$f":"IF(B257=\"\",\"\",INDEX('Units and Spaces'!C:C,MATCH(Observations!B257,'Units and Spaces'!B:B,0)))","v":""},null,null,"",null,null,null,null,null,"","",false,{"$f":"INDEX(EWEMs!$E$5:$E$24,MATCH(D257,EWEMs!$W$5:$W$24,0))","v":{"$error":"#N/A"}},"not bath","not kitchen",{"$error":"#VALUE!"},{"$f":"VLOOKUP(Observations!R257,EWEMs!$B$5:$D$24,3,FALSE)","v":{"$error":"#VALUE!"}}]
[null,null,{"$f":"IF(B258=\"\",\"\",INDEX('Units and Spaces'!C:C,MATCH(Observations!B258,'Units and Spaces'!B:B,0)))","v":""},null,null,"",null,null,null,null,null,"","",false,{"$f":"INDEX(EWEMs!$E$5:$E$24,MATCH(D258,EWEMs!$W$5:$W$24,0))","v":{"$error":"#N/A"}},"not bath","not kitchen",{"$error":"#VALUE!"},{"$f":"VLOOKUP(Observations!R258,EWEMs!$B$5:$D$24,3,FALSE)","v":{"$error":"#VALUE!"}}]
[null,null,{"$f":"IF(B259=\"\",\"\",INDEX('Units and Spaces'!C:C,MATCH(Observations!B259,'Units and Spaces'!B:B,0)))","v":""},null,null,"",null,null,null,null,null,"","",false,{"$f":"INDEX(EWEMs!$E$5:$E$24,MATCH(D259,EWEMs!$W$5:$W$24,0))","v":{"$error":"#N/A"}},"not bath","not kitchen",{"$error":"#VALUE!"},{"$f":"VLOOKUP(Observations!R259,EWEMs!$B$5:$D$24,3,FALSE)","v":{"$error":"#VALUE!"}}]
[null,null,{"$f":"IF(B260=\"\",\"\",INDEX('Units and Spaces'!C:C,MATCH(Observations!B260,'Units and Spaces'!B:B,0)))","v":""},null,null,"",null,null,null,null,null,"","",false,{"$f":"INDEX(EWEMs!$E$5:$E$24,MATCH(D260,EWEMs!$W$5:$W$24,0))","v":{"$error":"#N/A"}},"not bath","not kitchen",{"$error":"#VALUE!"},{"$f":"VLOOKUP(Observations!R260,EWEMs!$B$5:$D$24,3,FALSE)","v":{"$error":"#VALUE!"}}]
[null,null,{"$f":"IF(B261=\"\",\"\",INDEX('Units and Spaces'!C:C,MATCH(Observations!B261,'Units and Spaces'!B:B,0)))","v":""},null,null,"",null,null,null,null,null,"","",false,{"$f":"INDEX(EWEMs!$E$5:$E$24,MATCH(D261,EWEMs!$W$5:$W$24,0))","v":{"$error":"#N/A"}},"not bath","not kitchen",{"$error":"#VALUE!"},{"$f":"VLOOKUP(Observations!R261,EWEMs!$B$5:$D$24,3,FALSE)","v":{"$error":"#VALUE!"}}]
[null,null,{"$f":"IF(B262=\"\",\"\",INDEX('Units and Spaces'!C:C,MATCH(Observations!B262,'Units and Spaces'!B:B,0)))","v":""},null,null,"",null,null,null,null,null,"","",false,{"$f":"INDEX(EWEMs!$E$5:$E$24,MATCH(D262,EWEMs!$W$5:$W$24,0))","v":{"$error":"#N/A"}},"not bath","not kitchen",{"$error":"#VALUE!"},{"$f":"VLOOKUP(Observations!R262,EWEMs!$B$5:$D$24,3,FALSE)","v":{"$error":"#VALUE!"}}]
[null,null,{"$f":"IF(B263=\"\",\"\",INDEX('Units and Spaces'!C:C,MATCH(Observations!B263,'Units and Spaces'!B:B,0)))","v":""},null,null,"",null,null,null,null,null,"","",false,{"$f":"INDEX(EWEMs!$E$5:$E$24,MATCH(D263,EWEMs!$W$5:$W$24,0))","v":{"$error":"#N/A"}},"not bath","not kitchen",{"$error":"#VALUE!"},{"$f":"VLOOKUP(Observations!R263,EWEMs!$B$5:$D$24,3,FALSE)","v":{"$error":"#VALUE!"}}]
[null,null,{"$f":"IF(B264=\"\",\"\",INDEX('Units and Spaces'!C:C,MATCH(Observations!B264,'Units and Spaces'!B:B,0)))","v":""},null,null,{"$f":"IF(AND(N264=TRUE,E264<>\"\"), IF(ISNUMBER(SEARCH(\"compliant\", P264)),P264,IF(ISNUMBER(SEARCH(\"compliant\",Q264)),Q264,IF(E264<=O264,\"compliant\",\"noncompliant\"))),\"\")","v":""},null,null,null,null,null,{"$f":"IF(OR(F264=\"compliant\",F264=\"noncompliant\"),D264&F264,D264&G264)","v":""},{"$f":"IF(C264=\"Apartment\",IF(B264=0,\"\",B264),\"\")","v":""},{"$f":"IF(OR(ISNUMBER(FIND(\"low-flow\",D264,1)), ISNUMBER(FIND(\"low-flush\",D264,1))),TRUE,FALSE)","v":false},{"$f":"INDEX(EWEMs!$E$5:$E$24,MATCH(D264,EWEMs!$W$5:$W$24,0))","v":{"$error":"#N/A"}},{"$f":"IF(OR(ISNUMBER(SEARCH(\"bath faucets\", D264)), AND( ISNUMBER(SEARCH(\"fixture\", D264)),ISNUMBER(SEARCH(\"bath\", S264)) )), IF(O264<=1, IF(AND(E264>=O264, E264<=1), \"compliant\", \"noncompliant\"), IF(AND(E264>=1, E264<=O264),\"compliant\",\"noncompliant\")), \"not bath\"\n)","v":"not bath"},{"$f":"IF(OR(ISNUMBER(SEARCH(\"kitchen faucets\", D264)), AND(ISNUMBER(SEARCH(\"fixtures\", D264)),ISNUMBER(SEARCH(\"kitchen\", S264)) )), IF(O264<=1.5, IF(AND(E264>=O264, E264<=1.5), \"compliant\", \"noncompliant\"), IF(AND(E264>=1.5, E264<=O264),\"compliant\",\"noncompliant\")), \"not kitchen\"\n)","v":"not kitchen"},{"$f":"LEFT(D264,(FIND(\" \",D264,1)-1))*1","v":{"$error":"#VALUE!"}},{"$f":"VLOOKUP(Observations!R264,EWEMs!$B$5:$D$24,3,FALSE)","v":{"$error":"#VALUE!"}}]
[null,null,{"$f":"IF(B265=\"\",\"\",INDEX('Units and Spaces'!C:C,MATCH(Observations!B265,'Units and Spaces'!B:B,0)))","v":""},null,null,"",null,null,null,null,null,"","",false,{"$f":"INDEX(EWEMs!$E$5:$E$24,MATCH(D265,EWEMs!$W$5:$W$24,0))","v":{"$error":"#N/A"}},"not bath","not kitchen",{"$error":"#VALUE!"},{"$f":"VLOOKUP(Observations!R265,EWEMs!$B$5:$D$24,3,FALSE)","v":{"$error":"#VALUE!"}}]
[null,null,{"$f":"IF(B266=\"\",\"\",INDEX('Units and Spaces'!C:C,MATCH(Observations!B266,'Units and Spaces'!B:B,0)))","v":""},null,null,"",null,null,null,null,null,"","",false,{"$f":"INDEX(EWEMs!$E$5:$E$24,MATCH(D266,EWEMs!$W$5:$W$24,0))","v":{"$error":"#N/A"}},"not bath","not kitchen",{"$error":"#VALUE!"},{"$f":"VLOOKUP(Observations!R266,EWEMs!$B$5:$D$24,3,FALSE)","v":{"$error":"#VALUE!"}}]
[null,null,{"$f":"IF(B267=\"\",\"\",INDEX('Units and Spaces'!C:C,MATCH(Observations!B267,'Units and Spaces'!B:B,0)))","v":""},null,null,"",null,null,null,null,null,"","",false,{"$f":"INDEX(EWEMs!$E$5:$E$24,MATCH(D267,EWEMs!$W$5:$W$24,0))","v":{"$error":"#N/A"}},"not bath","not kitchen",{"$error":"#VALUE!"},{"$f":"VLOOKUP(Observations!R267,EWEMs!$B$5:$D$24,3,FALSE)","v":{"$error":"#VALUE!"}}]
[null,null,{"$f":"IF(B268=\"\",\"\",INDEX('Units and Spaces'!C:C,MATCH(Observations!B268,'Units and Spaces'!B:B,0)))","v":""},null,null,"",null,null,null,null,null,"","",false,{"$f":"INDEX(EWEMs!$E$5:$E$24,MATCH(D268,EWEMs!$W$5:$W$24,0))","v":{"$error":"#N/A"}},"not bath","not kitchen",{"$error":"#VALUE!"},{"$f":"VLOOKUP(Observations!R268,EWEMs!$B$5:$D$24,3,FALSE)","v":{"$error":"#VALUE!"}}]
[null,null,{"$f":"IF(B269=\"\",\"\",INDEX('Units and Spaces'!C:C,MATCH(Observations!B269,'Units and Spaces'!B:B,0)))","v":""},null,null,"",null,null,null,null,null,"","",false,{"$f":"INDEX(EWEMs!$E$5:$E$24,MATCH(D269,EWEMs!$W$5:$W$24,0))","v":{"$error":"#N/A"}},"not bath","not kitchen",{"$error":"#VALUE!"},{"$f":"VLOOKUP(Observations!R269,EWEMs!$B$5:$D$24,3,FALSE)","v":{"$error":"#VALUE!"}}]
[null,null,{"$f":"IF(B270=\"\",\"\",INDEX('Units and Spaces'!C:C,MATCH(Observations!B270,'Units and Spaces'!B:B,0)))","v":""},null,null,"",null,null,null,null,null,"","",false,{"$f":"INDEX(EWEMs!$E$5:$E$24,MATCH(D270,EWEMs!$W$5:$W$24,0))","v":{"$error":"#N/A"}},"not bath","not kitchen",{"$error":"#VALUE!"},{"$f":"VLOOKUP(Observations!R270,EWEMs!$B$5:$D$24,3,FALSE)","v":{"$error":"#VALUE!"}}]
[null,null,{"$f":"IF(B271=\"\",\"\",INDEX('Units and Spaces'!C:C,MATCH(Observations!B271,'Units and Spaces'!B:B,0)))","v":""},null,null,"",null,null,null,null,null,"","",false,{"$f":"INDEX(EWEMs!$E$5:$E$24,MATCH(D271,EWEMs!$W$5:$W$24,0))","v":{"$error":"#N/A"}},"not bath","not kitchen",{"$error":"#VALUE!"},{"$f":"VLOOKUP(Observations!R271,EWEMs!$B$5:$D$24,3,FALSE)","v":{"$error":"#VALUE!"}}]
[null,null,{"$f":"IF(B272=\"\",\"\",INDEX('Units and Spaces'!C:C,MATCH(Observations!B272,'Units and Spaces'!B:B,0)))","v":""},null,null,"",null,null,null,null,null,"","",false,{"$f":"INDEX(EWEMs!$E$5:$E$24,MATCH(D272,EWEMs!$W$5:$W$24,0))","v":{"$error":"#N/A"}},"not bath","not kitchen",{"$error":"#VALUE!"},{"$f":"VLOOKUP(Observations!R272,EWEMs!$B$5:$D$24,3,FALSE)","v":{"$error":"#VALUE!"}}]
[null,null,{"$f":"IF(B273=\"\",\"\",INDEX('Units and Spaces'!C:C,MATCH(Observations!B273,'Units and Spaces'!B:B,0)))","v":""},null,null,"",null,null,null,null,null,"","",false,{"$f":"INDEX(EWEMs!$E$5:$E$24,MATCH(D273,EWEMs!$W$5:$W$24,0))","v":{"$error":"#N/A"}},"not bath","not kitchen",{"$error":"#VALUE!"},{"$f":"VLOOKUP(Observations!R273,EWEMs!$B$5:$D$24,3,FALSE)","v":{"$error":"#VALUE!"}}]
[null,null,{"$f":"IF(B274=\"\",\"\",INDEX('Units and Spaces'!C:C,MATCH(Observations!B274,'Units and Spaces'!B:B,0)))","v":""},null,null,"",null,null,null,null,null,"","",false,{"$f":"INDEX(EWEMs!$E$5:$E$24,MATCH(D274,EWEMs!$W$5:$W$24,0))","v":{"$error":"#N/A"}},"not bath","not kitchen",{"$error":"#VALUE!"},{"$f":"VLOOKUP(Observations!R274,EWEMs!$B$5:$D$24,3,FALSE)","v":{"$error":"#VALUE!"}}]
[null,null,{"$f":"IF(B275=\"\",\"\",INDEX('Units and Spaces'!C:C,MATCH(Observations!B275,'Units and Spaces'!B:B,0)))","v":""},null,null,"",null,null,null,null,null,"","",false,{"$f":"INDEX(EWEMs!$E$5:$E$24,MATCH(D275,EWEMs!$W$5:$W$24,0))","v":{"$error":"#N/A"}},"not bath","not kitchen",{"$error":"#VALUE!"},{"$f":"VLOOKUP(Observations!R275,EWEMs!$B$5:$D$24,3,FALSE)","v":{"$error":"#VALUE!"}}]
[null,null,{"$f":"IF(B276=\"\",\"\",INDEX('Units and Spaces'!C:C,MATCH(Observations!B276,'Units and Spaces'!B:B,0)))","v":""},null,null,"",null,null,null,null,null,"","",false,{"$f":"INDEX(EWEMs!$E$5:$E$24,MATCH(D276,EWEMs!$W$5:$W$24,0))","v":{"$error":"#N/A"}},"not bath","not kitchen",{"$error":"#VALUE!"},{"$f":"VLOOKUP(Observations!R276,EWEMs!$B$5:$D$24,3,FALSE)","v":{"$error":"#VALUE!"}}]
[null,null,{"$f":"IF(B277=\"\",\"\",INDEX('Units and Spaces'!C:C,MATCH(Observations!B277,'Units and Spaces'!B:B,0)))","v":""},null,null,"",null,null,null,null,null,"","",false,{"$f":"INDEX(EWEMs!$E$5:$E$24,MATCH(D277,EWEMs!$W$5:$W$24,0))","v":{"$error":"#N/A"}},"not bath","not kitchen",{"$error":"#VALUE!"},{"$f":"VLOOKUP(Observations!R277,EWEMs!$B$5:$D$24,3,FALSE)","v":{"$error":"#VALUE!"}}]
[null,null,{"$f":"IF(B278=\"\",\"\",INDEX('Units and Spaces'!C:C,MATCH(Observations!B278,'Units and Spaces'!B:B,0)))","v":""},null,null,"",null,null,null,null,null,"","",false,{"$f":"INDEX(EWEMs!$E$5:$E$24,MATCH(D278,EWEMs!$W$5:$W$24,0))","v":{"$error":"#N/A"}},"not bath","not kitchen",{"$error":"#VALUE!"},{"$f":"VLOOKUP(Observations!R278,EWEMs!$B$5:$D$24,3,FALSE)","v":{"$error":"#VALUE!"}}]
[null,null,{"$f":"IF(B279=\"\",\"\",INDEX('Units and Spaces'!C:C,MATCH(Observations!B279,'Units and Spaces'!B:B,0)))","v":""},null,null,"",null,null,null,null,null,"","",false,{"$f":"INDEX(EWEMs!$E$5:$E$24,MATCH(D279,EWEMs!$W$5:$W$24,0))","v":{"$error":"#N/A"}},"not bath","not kitchen",{"$error":"#VALUE!"},{"$f":"VLOOKUP(Observations!R279,EWEMs!$B$5:$D$24,3,FALSE)","v":{"$error":"#VALUE!"}}]
[null,null,{"$f":"IF(B280=\"\",\"\",INDEX('Units and Spaces'!C:C,MATCH(Observations!B280,'Units and Spaces'!B:B,0)))","v":""},null,null,"",null,null,null,null,null,"","",false,{"$f":"INDEX(EWEMs!$E$5:$E$24,MATCH(D280,EWEMs!$W$5:$W$24,0))","v":{"$error":"#N/A"}},"not bath","not kitchen",{"$error":"#VALUE!"},{"$f":"VLOOKUP(Observations!R280,EWEMs!$B$5:$D$24,3,FALSE)","v":{"$error":"#VALUE!"}}]
[null,null,{"$f":"IF(B281=\"\",\"\",INDEX('Units and Spaces'!C:C,MATCH(Observations!B281,'Units and Spaces'!B:B,0)))","v":""},null,null,"",null,null,null,null,null,"","",false,{"$f":"INDEX(EWEMs!$E$5:$E$24,MATCH(D281,EWEMs!$W$5:$W$24,0))","v":{"$error":"#N/A"}},"not bath","not kitchen",{"$error":"#VALUE!"},{"$f":"VLOOKUP(Observations!R281,EWEMs!$B$5:$D$24,3,FALSE)","v":{"$error":"#VALUE!"}}]
[null,null,{"$f":"IF(B282=\"\",\"\",INDEX('Units and Spaces'!C:C,MATCH(Observations!B282,'Units and Spaces'!B:B,0)))","v":""},null,null,"",null,null,null,null,null,"","",false,{"$f":"INDEX(EWEMs!$E$5:$E$24,MATCH(D282,EWEMs!$W$5:$W$24,0))","v":{"$error":"#N/A"}},"not bath","not kitchen",{"$error":"#VALUE!"},{"$f":"VLOOKUP(Observations!R282,EWEMs!$B$5:$D$24,3,FALSE)","v":{"$error":"#VALUE!"}}]
[null,null,{"$f":"IF(B283=\"\",\"\",INDEX('Units and Spaces'!C:C,MATCH(Observations!B283,'Units and Spaces'!B:B,0)))","v":""},null,null,"",null,null,null,null,null,"","",false,{"$f":"INDEX(EWEMs!$E$5:$E$24,MATCH(D283,EWEMs!$W$5:$W$24,0))","v":{"$error":"#N/A"}},"not bath","not kitchen",{"$error":"#VALUE!"},{"$f":"VLOOKUP(Observations!R283,EWEMs!$B$5:$D$24,3,FALSE)","v":{"$error":"#VALUE!"}}]
[null,null,{"$f":"IF(B284=\"\",\"\",INDEX('Units and Spaces'!C:C,MATCH(Observations!B284,'Units and Spaces'!B:B,0)))","v":""},null,null,"",null,null,null,null,null,"","",false,{"$f":"INDEX(EWEMs!$E$5:$E$24,MATCH(D284,EWEMs!$W$5:$W$24,0))","v":{"$error":"#N/A"}},"not bath","not kitchen",{"$error":"#VALUE!"},{"$f":"VLOOKUP(Observations!R284,EWEMs!$B$5:$D$24,3,FALSE)","v":{"$error":"#VALUE!"}}]
[null,null,{"$f":"IF(B285=\"\",\"\",INDEX('Units and Spaces'!C:C,MATCH(Observations!B285,'Units and Spaces'!B:B,0)))","v":""},null,null,"",null,null,null,null,null,"","",false,{"$f":"INDEX(EWEMs!$E$5:$E$24,MATCH(D285,EWEMs!$W$5:$W$24,0))","v":{"$error":"#N/A"}},"not bath","not kitchen",{"$error":"#VALUE!"},{"$f":"VLOOKUP(Observations!R285,EWEMs!$B$5:$D$24,3,FALSE)","v":{"$error":"#VALUE!"}}]
[null,null,{"$f":"IF(B286=\"\",\"\",INDEX('Units and Spaces'!C:C,MATCH(Observations!B286,'Units and Spaces'!B:B,0)))","v":""},null,null,"",null,null,null,null,null,"","",false,{"$f":"INDEX(EWEMs!$E$5:$E$24,MATCH(D286,EWEMs!$W$5:$W$24,0))","v":{"$error":"#N/A"}},"not bath","not kitchen",{"$error":"#VALUE!"},{"$f":"VLOOKUP(Observations!R286,EWEMs!$B$5:$D$24,3,FALSE)","v":{"$error":"#VALUE!"}}]
[null,null,{"$f":"IF(B287=\"\",\"\",INDEX('Units and Spaces'!C:C,MATCH(Observations!B287,'Units and Spaces'!B:B,0)))","v":""},null,null,"",null,null,null,null,null,"","",false,{"$f":"INDEX(EWEMs!$E$5:$E$24,MATCH(D287,EWEMs!$W$5:$W$24,0))","v":{"$error":"#N/A"}},"not bath","not kitchen",{"$error":"#VALUE!"},{"$f":"VLOOKUP(Observations!R287,EWEMs!$B$5:$D$24,3,FALSE)","v":{"$error":"#VALUE!"}}]
[null,null,{"$f":"IF(B288=\"\",\"\",INDEX('Units and Spaces'!C:C,MATCH(Observations!B288,'Units and Spaces'!B:B,0)))","v":""},null,null,"",null,null,null,null,null,"","",false,{"$f":"INDEX(EWEMs!$E$5:$E$24,MATCH(D288,EWEMs!$W$5:$W$24,0))","v":{"$error":"#N/A"}},"not bath","not kitchen",{"$error":"#VALUE!"},{"$f":"VLOOKUP(Observations!R288,EWEMs!$B$5:$D$24,3,FALSE)","v":{"$error":"#VALUE!"}}]
[null,null,{"$f":"IF(B289=\"\",\"\",INDEX('Units and Spaces'!C:C,MATCH(Observations!B289,'Units and Spaces'!B:B,0)))","v":""},null,null,"",null,null,null,null,null,"","",false,{"$f":"INDEX(EWEMs!$E$5:$E$24,MATCH(D289,EWEMs!$W$5:$W$24,0))","v":{"$error":"#N/A"}},"not bath","not kitchen",{"$error":"#VALUE!"},{"$f":"VLOOKUP(Observations!R289,EWEMs!$B$5:$D$24,3,FALSE)","v":{"$error":"#VALUE!"}}]
[null,null,{"$f":"IF(B290=\"\",\"\",INDEX('Units and Spaces'!C:C,MATCH(Observations!B290,'Units and Spaces'!B:B,0)))","v":""},null,null,"",null,null,null,null,null,"","",false,{"$f":"INDEX(EWEMs!$E$5:$E$24,MATCH(D290,EWEMs!$W$5:$W$24,0))","v":{"$error":"#N/A"}},"not bath","not kitchen",{"$error":"#VALUE!"},{"$f":"VLOOKUP(Observations!R290,EWEMs!$B$5:$D$24,3,FALSE)","v":{"$error":"#VALUE!"}}]
[null,null,{"$f":"IF(B291=\"\",\"\",INDEX('Units and Spaces'!C:C,MATCH(Observations!B291,'Units and Spaces'!B:B,0)))","v":""},null,null,"",null,null,null,null,null,"","",false,{"$f":"INDEX(EWEMs!$E$5:$E$24,MATCH(D291,EWEMs!$W$5:$W$24,0))","v":{"$error":"#N/A"}},"not bath","not kitchen",{"$error":"#VALUE!"},{"$f":"VLOOKUP(Observations!R291,EWEMs!$B$5:$D$24,3,FALSE)","v":{"$error":"#VALUE!"}}]
[null,null,{"$f":"IF(B292=\"\",\"\",INDEX('Units and Spaces'!C:C,MATCH(Observations!B292,'Units and Spaces'!B:B,0)))","v":""},null,null,"",null,null,null,null,null,"","",false,{"$f":"INDEX(EWEMs!$E$5:$E$24,MATCH(D292,EWEMs!$W$5:$W$24,0))","v":{"$error":"#N/A"}},"not bath","not kitchen",{"$error":"#VALUE!"},{"$f":"VLOOKUP(Observations!R292,EWEMs!$B$5:$D$24,3,FALSE)","v":{"$error":"#VALUE!"}}]
[null,null,{"$f":"IF(B293=\"\",\"\",INDEX('Units and Spaces'!C:C,MATCH(Observations!B293,'Units and Spaces'!B:B,0)))","v":""},null,null,"",null,null,null,null,null,"","",false,{"$f":"INDEX(EWEMs!$E$5:$E$24,MATCH(D293,EWEMs!$W$5:$W$24,0))","v":{"$error":"#N/A"}},"not bath","not kitchen",{"$error":"#VALUE!"},{"$f":"VLOOKUP(Observations!R293,EWEMs!$B$5:$D$24,3,FALSE)","v":{"$error":"#VALUE!"}}]
[null,null,{"$f":"IF(B294=\"\",\"\",INDEX('Units and Spaces'!C:C,MATCH(Observations!B294,'Units and Spaces'!B:B,0)))","v":""},null,null,"",null,null,null,null,null,"","",false,{"$f":"INDEX(EWEMs!$E$5:$E$24,MATCH(D294,EWEMs!$W$5:$W$24,0))","v":{"$error":"#N/A"}},"not bath","not kitchen",{"$error":"#VALUE!"},{"$f":"VLOOKUP(Observations!R294,EWEMs!$B$5:$D$24,3,FALSE)","v":{"$error":"#VALUE!"}}]
[null,null,{"$f":"IF(B295=\"\",\"\",INDEX('Units and Spaces'!C:C,MATCH(Observations!B295,'Units and Spaces'!B:B,0)))","v":""},null,null,"",null,null,null,null,null,"","",false,{"$f":"INDEX(EWEMs!$E$5:$E$24,MATCH(D295,EWEMs!$W$5:$W$24,0))","v":{"$error":"#N/A"}},"not bath","not kitchen",{"$error":"#VALUE!"},{"$f":"VLOOKUP(Observations!R295,EWEMs!$B$5:$D$24,3,FALSE)","v":{"$error":"#VALUE!"}}]
[null,null,{"$f":"IF(B296=\"\",\"\",INDEX('Units and Spaces'!C:C,MATCH(Observations!B296,'Units and Spaces'!B:B,0)))","v":""},null,null,"",null,null,null,null,null,"","",false,{"$f":"INDEX(EWEMs!$E$5:$E$24,MATCH(D296,EWEMs!$W$5:$W$24,0))","v":{"$error":"#N/A"}},"not bath","not kitchen",{"$error":"#VALUE!"},{"$f":"VLOOKUP(Observations!R296,EWEMs!$B$5:$D$24,3,FALSE)","v":{"$error":"#VALUE!"}}]
[null,null,{"$f":"IF(B297=\"\",\"\",INDEX('Units and Spaces'!C:C,MATCH(Observations!B297,'Units and Spaces'!B:B,0)))","v":""},null,null,"",null,null,null,null,null,"","",false,{"$f":"INDEX(EWEMs!$E$5:$E$24,MATCH(D297,EWEMs!$W$5:$W$24,0))","v":{"$error":"#N/A"}},"not bath","not kitchen",{"$error":"#VALUE!"},{"$f":"VLOOKUP(Observations!R297,EWEMs!$B$5:$D$24,3,FALSE)","v":{"$error":"#VALUE!"}}]
[null,null,{"$f":"IF(B298=\"\",\"\",INDEX('Units and Spaces'!C:C,MATCH(Observations!B298,'Units and Spaces'!B:B,0)))","v":""},null,null,"",null,null,null,null,null,"","",false,{"$f":"INDEX(EWEMs!$E$5:$E$24,MATCH(D298,EWEMs!$W$5:$W$24,0))","v":{"$error":"#N/A"}},"not bath","not kitchen",{"$error":"#VALUE!"},{"$f":"VLOOKUP(Observations!R298,EWEMs!$B$5:$D$24,3,FALSE)","v":{"$error":"#VALUE!"}}]
[null,null,{"$f":"IF(B299=\"\",\"\",INDEX('Units and Spaces'!C:C,MATCH(Observations!B299,'Units and Spaces'!B:B,0)))","v":""},null,null,"",null,null,null,null,null,"","",false,{"$f":"INDEX(EWEMs!$E$5:$E$24,MATCH(D299,EWEMs!$W$5:$W$24,0))","v":{"$error":"#N/A"}},"not bath","not kitchen",{"$error":"#VALUE!"},{"$f":"VLOOKUP(Observations!R299,EWEMs!$B$5:$D$24,3,FALSE)","v":{"$error":"#VALUE!"}}]
[null,null,{"$f":"IF(B300=\"\",\"\",INDEX('Units and Spaces'!C:C,MATCH(Observations!B300,'Units and Spaces'!B:B,0)))","v":""},null,null,"",null,null,null,null,null,"","",false,{"$f":"INDEX(EWEMs!$E$5:$E$24,MATCH(D300,EWEMs!$W$5:$W$24,0))","v":{"$error":"#N/A"}},"not bath","not kitchen",{"$error":"#VALUE!"},{"$f":"VLOOKUP(Observations!R300,EWEMs!$B$5:$D$24,3,FALSE)","v":{"$error":"#VALUE!"}}]
[null,null,{"$f":"IF(B301=\"\",\"\",INDEX('Units and Spaces'!C:C,MATCH(Observations!B301,'Units and Spaces'!B:B,0)))","v":""},null,null,"",null,null,null,null,null,"","",false,{"$f":"INDEX(EWEMs!$E$5:$E$24,MATCH(D301,EWEMs!$W$5:$W$24,0))","v":{"$error":"#N/A"}},"not bath","not kitchen",{"$error":"#VALUE!"},{"$f":"VLOOKUP(Observations!R301,EWEMs!$B$5:$D$24,3,FALSE)","v":{"$error":"#VALUE!"}}]
[null,null,{"$f":"IF(B302=\"\",\"\",INDEX('Units and Spaces'!C:C,MATCH(Observations!B302,'Units and Spaces'!B:B,0)))","v":""},null,null,"",null,null,null,null,null,"","",false,{"$f":"INDEX(EWEMs!$E$5:$E$24,MATCH(D302,EWEMs!$W$5:$W$24,0))","v":{"$error":"#N/A"}},"not bath","not kitchen",{"$error":"#VALUE!"},{"$f":"VLOOKUP(Observations!R302,EWEMs!$B$5:$D$24,3,FALSE)","v":{"$error":"#VALUE!"}}]
[null,null,{"$f":"IF(B303=\"\",\"\",INDEX('Units and Spaces'!C:C,MATCH(Observations!B303,'Units and Spaces'!B:B,0)))","v":""},null,null,"",null,null,null,null,null,"","",false,{"$f":"INDEX(EWEMs!$E$5:$E$24,MATCH(D303,EWEMs!$W$5:$W$24,0))","v":{"$error":"#N/A"}},"not bath","not kitchen",{"$error":"#VALUE!"},{"$f":"VLOOKUP(Observations!R303,EWEMs!$B$5:$D$24,3,FALSE)","v":{"$error":"#VALUE!"}}]
[null,null,{"$f":"IF(B304=\"\",\"\",INDEX('Units and Spaces'!C:C,MATCH(Observations!B304,'Units and Spaces'!B:B,0)))","v":""},null,null,"",null,null,null,null,null,"","",false,{"$f":"INDEX(EWEMs!$E$5:$E$24,MATCH(D304,EWEMs!$W$5:$W$24,0))","v":{"$error":"#N/A"}},"not bath","not kitchen",{"$error":"#VALUE!"},{"$f":"VLOOKUP(Observations!R304,EWEMs!$B$5:$D$24,3,FALSE)","v":{"$error":"#VALUE!"}}]
[null,null,{"$f":"IF(B305=\"\",\"\",INDEX('Units and Spaces'!C:C,MATCH(Observations!B305,'Units and Spaces'!B:B,0)))","v":""},null,null,"",null,null,null,null,null,"","",false,{"$f":"INDEX(EWEMs!$E$5:$E$24,MATCH(D305,EWEMs!$W$5:$W$24,0))","v":{"$error":"#N/A"}},"not bath","not kitchen",{"$error":"#VALUE!"},{"$f":"VLOOKUP(Observations!R305,EWEMs!$B$5:$D$24,3,FALSE)","v":{"$error":"#VALUE!"}}]
[null,null,{"$f":"IF(B306=\"\",\"\",INDEX('Units and Spaces'!C:C,MATCH(Observations!B306,'Units and Spaces'!B:B,0)))","v":""},null,null,"",null,null,null,null,null,"","",false,{"$f":"INDEX(EWEMs!$E$5:$E$24,MATCH(D306,EWEMs!$W$5:$W$24,0))","v":{"$error":"#N/A"}},"not bath","not kitchen",{"$error":"#VALUE!"},{"$f":"VLOOKUP(Observations!R306,EWEMs!$B$5:$D$24,3,FALSE)","v":{"$error":"#VALUE!"}}]
[null,null,{"$f":"IF(B307=\"\",\"\",INDEX('Units and Spaces'!C:C,MATCH(Observations!B307,'Units and Spaces'!B:B,0)))","v":""},null,null,"",null,null,null,null,null,"","",false,{"$f":"INDEX(EWEMs!$E$5:$E$24,MATCH(D307,EWEMs!$W$5:$W$24,0))","v":{"$error":"#N/A"}},"not bath","not kitchen",{"$error":"#VALUE!"},{"$f":"VLOOKUP(Observations!R307,EWEMs!$B$5:$D$24,3,FALSE)","v":{"$error":"#VALUE!"}}]
[null,null,{"$f":"IF(B308=\"\",\"\",INDEX('Units and Spaces'!C:C,MATCH(Observations!B308,'Units and Spaces'!B:B,0)))","v":""},null,null,"",null,null,null,null,null,"","",false,{"$f":"INDEX(EWEMs!$E$5:$E$24,MATCH(D308,EWEMs!$W$5:$W$24,0))","v":{"$error":"#N/A"}},"not bath","not kitchen",{"$error":"#VALUE!"},{"$f":"VLOOKUP(Observations!R308,EWEMs!$B$5:$D$24,3,FALSE)","v":{"$error":"#VALUE!"}}]
[null,null,{"$f":"IF(B309=\"\",\"\",INDEX('Units and Spaces'!C:C,MATCH(Observations!B309,'Units and Spaces'!B:B,0)))","v":""},null,null,"",null,null,null,null,null,"","",false,{"$f":"INDEX(EWEMs!$E$5:$E$24,MATCH(D309,EWEMs!$W$5:$W$24,0))","v":{"$error":"#N/A"}},"not bath","not kitchen",{"$error":"#VALUE!"},{"$f":"VLOOKUP(Observations!R309,EWEMs!$B$5:$D$24,3,FALSE)","v":{"$error":"#VALUE!"}}]
[null,null,{"$f":"IF(B310=\"\",\"\",INDEX('Units and Spaces'!C:C,MATCH(Observations!B310,'Units and Spaces'!B:B,0)))","v":""},null,null,"",null,null,null,null,null,"","",false,{"$f":"INDEX(EWEMs!$E$5:$E$24,MATCH(D310,EWEMs!$W$5:$W$24,0))","v":{"$error":"#N/A"}},"not bath","not kitchen",{"$error":"#VALUE!"},{"$f":"VLOOKUP(Observations!R310,EWEMs!$B$5:$D$24,3,FALSE)","v":{"$error":"#VALUE!"}}]
[null,null,{"$f":"IF(B311=\"\",\"\",INDEX('Units and Spaces'!C:C,MATCH(Observations!B311,'Units and Spaces'!B:B,0)))","v":""},null,null,"",null,null,null,null,null,"","",false,{"$f":"INDEX(EWEMs!$E$5:$E$24,MATCH(D311,EWEMs!$W$5:$W$24,0))","v":{"$error":"#N/A"}},"not bath","not kitchen",{"$error":"#VALUE!"},{"$f":"VLOOKUP(Observations!R311,EWEMs!$B$5:$D$24,3,FALSE)","v":{"$error":"#VALUE!"}}]
[null,null,{"$f":"IF(B312=\"\",\"\",INDEX('Units and Spaces'!C:C,MATCH(Observations!B312,'Units and Spaces'!B:B,0)))","v":""},null,null,"",null,null,null,null,null,"","",false,{"$f":"INDEX(EWEMs!$E$5:$E$24,MATCH(D312,EWEMs!$W$5:$W$24,0))","v":{"$error":"#N/A"}},"not bath","not kitchen",{"$error":"#VALUE!"},{"$f":"VLOOKUP(Observations!R312,EWEMs!$B$5:$D$24,3,FALSE)","v":{"$error":"#VALUE!"}}]
[null,null,{"$f":"IF(B313=\"\",\"\",INDEX('Units and Spaces'!C:C,MATCH(Observations!B313,'Units and Spaces'!B:B,0)))","v":""},null,null,"",null,null,null,null,null,"","",false,{"$f":"INDEX(EWEMs!$E$5:$E$24,MATCH(D313,EWEMs!$W$5:$W$24,0))","v":{"$error":"#N/A"}},"not bath","not kitchen",{"$error":"#VALUE!"},{"$f":"VLOOKUP(Observations!R313,EWEMs!$B$5:$D$24,3,FALSE)","v":{"$error":"#VALUE!"}}]
[null,null,{"$f":"IF(B314=\"\",\"\",INDEX('Units and Spaces'!C:C,MATCH(Observations!B314,'Units and Spaces'!B:B,0)))","v":""},null,null,"",null,null,null,null,null,"","",false,{"$f":"INDEX(EWEMs!$E$5:$E$24,MATCH(D314,EWEMs!$W$5:$W$24,0))","v":{"$error":"#N/A"}},"not bath","not kitchen",{"$error":"#VALUE!"},{"$f":"VLOOKUP(Observations!R314,EWEMs!$B$5:$D$24,3,FALSE)","v":{"$error":"#VALUE!"}}]
[null,null,{"$f":"IF(B315=\"\",\"\",INDEX('Units and Spaces'!C:C,MATCH(Observations!B315,'Units and Spaces'!B:B,0)))","v":""},null,null,"",null,null,null,null,null,"","",false,{"$f":"INDEX(EWEMs!$E$5:$E$24,MATCH(D315,EWEMs!$W$5:$W$24,0))","v":{"$error":"#N/A"}},"not bath","not kitchen",{"$error":"#VALUE!"},{"$f":"VLOOKUP(Observations!R315,EWEMs!$B$5:$D$24,3,FALSE)","v":{"$error":"#VALUE!"}}]
[null,null,{"$f":"IF(B316=\"\",\"\",INDEX('Units and Spaces'!C:C,MATCH(Observations!B316,'Units and Spaces'!B:B,0)))","v":""},null,null,"",null,null,null,null,null,"","",false,{"$f":"INDEX(EWEMs!$E$5:$E$24,MATCH(D316,EWEMs!$W$5:$W$24,0))","v":{"$error":"#N/A"}},"not bath","not kitchen",{"$error":"#VALUE!"},{"$f":"VLOOKUP(Observations!R316,EWEMs!$B$5:$D$24,3,FALSE)","v":{"$error":"#VALUE!"}}]
[null,null,{"$f":"IF(B317=\"\",\"\",INDEX('Units and Spaces'!C:C,MATCH(Observations!B317,'Units and Spaces'!B:B,0)))","v":""},null,null,"",null,null,null,null,null,"","",false,{"$f":"INDEX(EWEMs!$E$5:$E$24,MATCH(D317,EWEMs!$W$5:$W$24,0))","v":{"$error":"#N/A"}},"not bath","not kitchen",{"$error":"#VALUE!"},{"$f":"VLOOKUP(Observations!R317,EWEMs!$B$5:$D$24,3,FALSE)","v":{"$error":"#VALUE!"}}]
[null,null,{"$f":"IF(B318=\"\",\"\",INDEX('Units and Spaces'!C:C,MATCH(Observations!B318,'Units and Spaces'!B:B,0)))","v":""},null,null,"",null,null,null,null,null,"","",false,{"$f":"INDEX(EWEMs!$E$5:$E$24,MATCH(D318,EWEMs!$W$5:$W$24,0))","v":{"$error":"#N/A"}},"not bath","not kitchen",{"$error":"#VALUE!"},{"$f":"VLOOKUP(Observations!R318,EWEMs!$B$5:$D$24,3,FALSE)","v":{"$error":"#VALUE!"}}]
[null,null,{"$f":"IF(B319=\"\",\"\",INDEX('Units and Spaces'!C:C,MATCH(Observations!B319,'Units and Spaces'!B:B,0)))","v":""},null,null,"",null,null,null,null,null,"","",false,{"$f":"INDEX(EWEMs!$E$5:$E$24,MATCH(D319,EWEMs!$W$5:$W$24,0))","v":{"$error":"#N/A"}},"not bath","not kitchen",{"$error":"#VALUE!"},{"$f":"VLOOKUP(Observations!R319,EWEMs!$B$5:$D$24,3,FALSE)","v":{"$error":"#VALUE!"}}]
[null,null,{"$f":"IF(B320=\"\",\"\",INDEX('Units and Spaces'!C:C,MATCH(Observations!B320,'Units and Spaces'!B:B,0)))","v":""},null,null,"",null,null,null,null,null,"","",false,{"$f":"INDEX(EWEMs!$E$5:$E$24,MATCH(D320,EWEMs!$W$5:$W$24,0))","v":{"$error":"#N/A"}},"not bath","not kitchen",{"$error":"#VALUE!"},{"$f":"VLOOKUP(Observations!R320,EWEMs!$B$5:$D$24,3,FALSE)","v":{"$error":"#VALUE!"}}]
[null,null,{"$f":"IF(B321=\"\",\"\",INDEX('Units and Spaces'!C:C,MATCH(Observations!B321,'Units and Spaces'!B:B,0)))","v":""},null,null,"",null,null,null,null,null,"","",false,{"$f":"INDEX(EWEMs!$E$5:$E$24,MATCH(D321,EWEMs!$W$5:$W$24,0))","v":{"$error":"#N/A"}},"not bath","not kitchen",{"$error":"#VALUE!"},{"$f":"VLOOKUP(Observations!R321,EWEMs!$B$5:$D$24,3,FALSE)","v":{"$error":"#VALUE!"}}]
[null,null,{"$f":"IF(B322=\"\",\"\",INDEX('Units and Spaces'!C:C,MATCH(Observations!B322,'Units and Spaces'!B:B,0)))","v":""},null,null,"",null,null,null,null,null,"","",false,{"$f":"INDEX(EWEMs!$E$5:$E$24,MATCH(D322,EWEMs!$W$5:$W$24,0))","v":{"$error":"#N/A"}},"not bath","not kitchen",{"$error":"#VALUE!"},{"$f":"VLOOKUP(Observations!R322,EWEMs!$B$5:$D$24,3,FALSE)","v":{"$error":"#VALUE!"}}]
[null,null,{"$f":"IF(B323=\"\",\"\",INDEX('Units and Spaces'!C:C,MATCH(Observations!B323,'Units and Spaces'!B:B,0)))","v":""},null,null,"",null,null,null,null,null,"","",false,{"$f":"INDEX(EWEMs!$E$5:$E$24,MATCH(D323,EWEMs!$W$5:$W$24,0))","v":{"$error":"#N/A"}},"not bath","not kitchen",{"$error":"#VALUE!"},{"$f":"VLOOKUP(Observations!R323,EWEMs!$B$5:$D$24,3,FALSE)","v":{"$error":"#VALUE!"}}]
[null,null,{"$f":"IF(B324=\"\",\"\",INDEX('Units and Spaces'!C:C,MATCH(Observations!B324,'Units and Spaces'!B:B,0)))","v":""},null,null,"",null,null,null,null,null,"","",false,{"$f":"INDEX(EWEMs!$E$5:$E$24,MATCH(D324,EWEMs!$W$5:$W$24,0))","v":{"$error":"#N/A"}},"not bath","not kitchen",{"$error":"#VALUE!"},{"$f":"VLOOKUP(Observations!R324,EWEMs!$B$5:$D$24,3,FALSE)","v":{"$error":"#VALUE!"}}]
[null,null,{"$f":"IF(B325=\"\",\"\",INDEX('Units and Spaces'!C:C,MATCH(Observations!B325,'Units and Spaces'!B:B,0)))","v":""},null,null,"",null,null,null,null,null,"","",false,{"$f":"INDEX(EWEMs!$E$5:$E$24,MATCH(D325,EWEMs!$W$5:$W$24,0))","v":{"$error":"#N/A"}},"not bath","not kitchen",{"$error":"#VALUE!"},{"$f":"VLOOKUP(Observations!R325,EWEMs!$B$5:$D$24,3,FALSE)","v":{"$error":"#VALUE!"}}]
[null,null,{"$f":"IF(B326=\"\",\"\",INDEX('Units and Spaces'!C:C,MATCH(Observations!B326,'Units and Spaces'!B:B,0)))","v":""},null,null,"",null,null,null,null,null,"","",false,{"$f":"INDEX(EWEMs!$E$5:$E$24,MATCH(D326,EWEMs!$W$5:$W$24,0))","v":{"$error":"#N/A"}},"not bath","not kitchen",{"$error":"#VALUE!"},{"$f":"VLOOKUP(Observations!R326,EWEMs!$B$5:$D$24,3,FALSE)","v":{"$error":"#VALUE!"}}]
[null,null,{"$f":"IF(B327=\"\",\"\",INDEX('Units and Spaces'!C:C,MATCH(Observations!B327,'Units and Spaces'!B:B,0)))","v":""},null,null,"",null,null,null,null,null,"","",false,{"$f":"INDEX(EWEMs!$E$5:$E$24,MATCH(D327,EWEMs!$W$5:$W$24,0))","v":{"$error":"#N/A"}},"not bath","not kitchen",{"$error":"#VALUE!"},{"$f":"VLOOKUP(Observations!R327,EWEMs!$B$5:$D$24,3,FALSE)","v":{"$error":"#VALUE!"}}]
[null,null,{"$f":"IF(B328=\"\",\"\",INDEX('Units and Spaces'!C:C,MATCH(Observations!B328,'Units and Spaces'!B:B,0)))","v":""},null,null,{"$f":"IF(AND(N328=TRUE,E328<>\"\"), IF(ISNUMBER(SEARCH(\"compliant\", P328)),P328,IF(ISNUMBER(SEARCH(\"compliant\",Q328)),Q328,IF(E328<=O328,\"compliant\",\"noncompliant\"))),\"\")","v":""},null,null,null,null,null,{"$f":"IF(OR(F328=\"compliant\",F328=\"noncompliant\"),D328&F328,D328&G328)","v":""},{"$f":"IF(C328=\"Apartment\",IF(B328=0,\"\",B328),\"\")","v":""},{"$f":"IF(OR(ISNUMBER(FIND(\"low-flow\",D328,1)), ISNUMBER(FIND(\"low-flush\",D328,1))),TRUE,FALSE)","v":false},{"$f":"INDEX(EWEMs!$E$5:$E$24,MATCH(D328,EWEMs!$W$5:$W$24,0))","v":{"$error":"#N/A"}},{"$f":"IF(OR(ISNUMBER(SEARCH(\"bath faucets\", D328)), AND( ISNUMBER(SEARCH(\"fixture\", D328)),ISNUMBER(SEARCH(\"bath\", S328)) )), IF(O328<=1, IF(AND(E328>=O328, E328<=1), \"compliant\", \"noncompliant\"), IF(AND(E328>=1, E328<=O328),\"compliant\",\"noncompliant\")), \"not bath\"\n)","v":"not bath"},{"$f":"IF(OR(ISNUMBER(SEARCH(\"kitchen faucets\", D328)), AND(ISNUMBER(SEARCH(\"fixtures\", D328)),ISNUMBER(SEARCH(\"kitchen\", S328)) )), IF(O328<=1.5, IF(AND(E328>=O328, E328<=1.5), \"compliant\", \"noncompliant\"), IF(AND(E328>=1.5, E328<=O328),\"compliant\",\"noncompliant\")), \"not kitchen\"\n)","v":"not kitchen"},{"$f":"LEFT(D328,(FIND(\" \",D328,1)-1))*1","v":{"$error":"#VALUE!"}},{"$f":"VLOOKUP(Observations!R328,EWEMs!$B$5:$D$24,3,FALSE)","v":{"$error":"#VALUE!"}}]
[null,null,{"$f":"IF(B329=\"\",\"\",INDEX('Units and Spaces'!C:C,MATCH(Observations!B329,'Units and Spaces'!B:B,0)))","v":""},null,null,"",null,null,null,null,null,"","",false,{"$f":"INDEX(EWEMs!$E$5:$E$24,MATCH(D329,EWEMs!$W$5:$W$24,0))","v":{"$error":"#N/A"}},"not bath","not kitchen",{"$error":"#VALUE!"},{"$f":"VLOOKUP(Observations!R329,EWEMs!$B$5:$D$24,3,FALSE)","v":{"$error":"#VALUE!"}}]
[null,null,{"$f":"IF(B330=\"\",\"\",INDEX('Units and Spaces'!C:C,MATCH(Observations!B330,'Units and Spaces'!B:B,0)))","v":""},null,null,"",null,null,null,null,null,"","",false,{"$f":"INDEX(EWEMs!$E$5:$E$24,MATCH(D330,EWEMs!$W$5:$W$24,0))","v":{"$error":"#N/A"}},"not bath","not kitchen",{"$error":"#VALUE!"},{"$f":"VLOOKUP(Observations!R330,EWEMs!$B$5:$D$24,3,FALSE)","v":{"$error":"#VALUE!"}}]
[null,null,{"$f":"IF(B331=\"\",\"\",INDEX('Units and Spaces'!C:C,MATCH(Observations!B331,'Units and Spaces'!B:B,0)))","v":""},null,null,"",null,null,null,null,null,"","",false,{"$f":"INDEX(EWEMs!$E$5:$E$24,MATCH(D331,EWEMs!$W$5:$W$24,0))","v":{"$error":"#N/A"}},"not bath","not kitchen",{"$error":"#VALUE!"},{"$f":"VLOOKUP(Observations!R331,EWEMs!$B$5:$D$24,3,FALSE)","v":{"$error":"#VALUE!"}}]
[null,null,{"$f":"IF(B332=\"\",\"\",INDEX('Units and Spaces'!C:C,MATCH(Observations!B332,'Units and Spaces'!B:B,0)))","v":""},null,null,"",null,null,null,null,null,"","",false,{"$f":"INDEX(EWEMs!$E$5:$E$24,MATCH(D332,EWEMs!$W$5:$W$24,0))","v":{"$error":"#N/A"}},"not bath","not kitchen",{"$error":"#VALUE!"},{"$f":"VLOOKUP(Observations!R332,EWEMs!$B$5:$D$24,3,FALSE)","v":{"$error":"#VALUE!"}}]
[null,null,{"$f":"IF(B333=\"\",\"\",INDEX('Units and Spaces'!C:C,MATCH(Observations!B333,'Units and Spaces'!B:B,0)))","v":""},null,null,"",null,null,null,null,null,"","",false,{"$f":"INDEX(EWEMs!$E$5:$E$24,MATCH(D333,EWEMs!$W$5:$W$24,0))","v":{"$error":"#N/A"}},"not bath","not kitchen",{"$error":"#VALUE!"},{"$f":"VLOOKUP(Observations!R333,EWEMs!$B$5:$D$24,3,FALSE)","v":{"$error":"#VALUE!"}}]
[null,null,{"$f":"IF(B334=\"\",\"\",INDEX('Units and Spaces'!C:C,MATCH(Observations!B334,'Units and Spaces'!B:B,0)))","v":""},null,null,"",null,null,null,null,null,"","",false,{"$f":"INDEX(EWEMs!$E$5:$E$24,MATCH(D334,EWEMs!$W$5:$W$24,0))","v":{"$error":"#N/A"}},"not bath","not kitchen",{"$error":"#VALUE!"},{"$f":"VLOOKUP(Observations!R334,EWEMs!$B$5:$D$24,3,FALSE)","v":{"$error":"#VALUE!"}}]
[null,null,{"$f":"IF(B335=\"\",\"\",INDEX('Units and Spaces'!C:C,MATCH(Observations!B335,'Units and Spaces'!B:B,0)))","v":""},null,null,"",null,null,null,null,null,"","",false,{"$f":"INDEX(EWEMs!$E$5:$E$24,MATCH(D335,EWEMs!$W$5:$W$24,0))","v":{"$error":"#N/A"}},"not bath","not kitchen",{"$error":"#VALUE!"},{"$f":"VLOOKUP(Observations!R335,EWEMs!$B$5:$D$24,3,FALSE)","v":{"$error":"#VALUE!"}}]
[null,null,{"$f":"IF(B336=\"\",\"\",INDEX('Units and Spaces'!C:C,MATCH(Observations!B336,'Units and Spaces'!B:B,0)))","v":""},null,null,"",null,null,null,null,null,"","",false,{"$f":"INDEX(EWEMs!$E$5:$E$24,MATCH(D336,EWEMs!$W$5:$W$24,0))","v":{"$error":"#N/A"}},"not bath","not kitchen",{"$error":"#VALUE!"},{"$f":"VLOOKUP(Observations!R336,EWEMs!$B$5:$D$24,3,FALSE)","v":{"$error":"#VALUE!"}}]
[null,null,{"$f":"IF(B337=\"\",\"\",INDEX('Units and Spaces'!C:C,MATCH(Observations!B337,'Units and Spaces'!B:B,0)))","v":""},null,null,"",null,null,null,null,null,"","",false,{"$f":"INDEX(EWEMs!$E$5:$E$24,MATCH(D337,EWEMs!$W$5:$W$24,0))","v":{"$error":"#N/A"}},"not bath","not kitchen",{"$error":"#VALUE!"},{"$f":"VLOOKUP(Observations!R337,EWEMs!$B$5:$D$24,3,FALSE)","v":{"$error":"#VALUE!"}}]
[null,null,{"$f":"IF(B338=\"\",\"\",INDEX('Units and Spaces'!C:C,MATCH(Observations!B338,'Units and Spaces'!B:B,0)))","v":""},null,null,"",null,null,null,null,null,"","",false,{"$f":"INDEX(EWEMs!$E$5:$E$24,MATCH(D338,EWEMs!$W$5:$W$24,0))","v":{"$error":"#N/A"}},"not bath","not kitchen",{"$error":"#VALUE!"},{"$f":"VLOOKUP(Observations!R338,EWEMs!$B$5:$D$24,3,FALSE)","v":{"$error":"#VALUE!"}}]
[null,null,{"$f":"IF(B339=\"\",\"\",INDEX('Units and Spaces'!C:C,MATCH(Observations!B339,'Units and Spaces'!B:B,0)))","v":""},null,null,"",null,null,null,null,null,"","",false,{"$f":"INDEX(EWEMs!$E$5:$E$24,MATCH(D339,EWEMs!$W$5:$W$24,0))","v":{"$error":"#N/A"}},"not bath","not kitchen",{"$error":"#VALUE!"},{"$f":"VLOOKUP(Observations!R339,EWEMs!$B$5:$D$24,3,FALSE)","v":{"$error":"#VALUE!"}}]
[null,null,{"$f":"IF(B340=\"\",\"\",INDEX('Units and Spaces'!C:C,MATCH(Observations!B340,'Units and Spaces'!B:B,0)))","v":""},null,null,"",null,null,null,null,null,"","",false,{"$f":"INDEX(EWEMs!$E$5:$E$24,MATCH(D340,EWEMs!$W$5:$W$24,0))","v":{"$error":"#N/A"}},"not bath","not kitchen",{"$error":"#VALUE!"},{"$f":"VLOOKUP(Observations!R340,EWEMs!$B$5:$D$24,3,FALSE)","v":{"$error":"#VALUE!"}}]
[null,null,{"$f":"IF(B341=\"\",\"\",INDEX('Units and Spaces'!C:C,MATCH(Observations!B341,'Units and Spaces'!B:B,0)))","v":""},null,null,"",null,null,null,null,null,"","",false,{"$f":"INDEX(EWEMs!$E$5:$E$24,MATCH(D341,EWEMs!$W$5:$W$24,0))","v":{"$error":"#N/A"}},"not bath","not kitchen",{"$error":"#VALUE!"},{"$f":"VLOOKUP(Observations!R341,EWEMs!$B$5:$D$24,3,FALSE)","v":{"$error":"#VALUE!"}}]
[null,null,{"$f":"IF(B342=\"\",\"\",INDEX('Units and Spaces'!C:C,MATCH(Observations!B342,'Units and Spaces'!B:B,0)))","v":""},null,null,"",null,null,null,null,null,"","",false,{"$f":"INDEX(EWEMs!$E$5:$E$24,MATCH(D342,EWEMs!$W$5:$W$24,0))","v":{"$error":"#N/A"}},"not bath","not kitchen",{"$error":"#VALUE!"},{"$f":"VLOOKUP(Observations!R342,EWEMs!$B$5:$D$24,3,FALSE)","v":{"$error":"#VALUE!"}}]
[null,null,{"$f":"IF(B343=\"\",\"\",INDEX('Units and Spaces'!C:C,MATCH(Observations!B343,'Units and Spaces'!B:B,0)))","v":""},null,null,"",null,null,null,null,null,"","",false,{"$f":"INDEX(EWEMs!$E$5:$E$24,MATCH(D343,EWEMs!$W$5:$W$24,0))","v":{"$error":"#N/A"}},"not bath","not kitchen",{"$error":"#VALUE!"},{"$f":"VLOOKUP(Observations!R343,EWEMs!$B$5:$D$24,3,FALSE)","v":{"$error":"#VALUE!"}}]
[null,null,{"$f":"IF(B344=\"\",\"\",INDEX('Units and Spaces'!C:C,MATCH(Observations!B344,'Units and Spaces'!B:B,0)))","v":""},null,null,"",null,null,null,null,null,"","",false,{"$f":"INDEX(EWEMs!$E$5:$E$24,MATCH(D344,EWEMs!$W$5:$W$24,0))","v":{"$error":"#N/A"}},"not bath","not kitchen",{"$error":"#VALUE!"},{"$f":"VLOOKUP(Observations!R344,EWEMs!$B$5:$D$24,3,FALSE)","v":{"$error":"#VALUE!"}}]
[null,null,{"$f":"IF(B345=\"\",\"\",INDEX('Units and Spaces'!C:C,MATCH(Observations!B345,'Units and Spaces'!B:B,0)))","v":""},null,null,"",null,null,null,null,null,"","",false,{"$f":"INDEX(EWEMs!$E$5:$E$24,MATCH(D345,EWEMs!$W$5:$W$24,0))","v":{"$error":"#N/A"}},"not bath","not kitchen",{"$error":"#VALUE!"},{"$f":"VLOOKUP(Observations!R345,EWEMs!$B$5:$D$24,3,FALSE)","v":{"$error":"#VALUE!"}}]
[null,null,{"$f":"IF(B346=\"\",\"\",INDEX('Units and Spaces'!C:C,MATCH(Observations!B346,'Units and Spaces'!B:B,0)))","v":""},null,null,"",null,null,null,null,null,"","",false,{"$f":"INDEX(EWEMs!$E$5:$E$24,MATCH(D346,EWEMs!$W$5:$W$24,0))","v":{"$error":"#N/A"}},"not bath","not kitchen",{"$error":"#VALUE!"},{"$f":"VLOOKUP(Observations!R346,EWEMs!$B$5:$D$24,3,FALSE)","v":{"$error":"#VALUE!"}}]
[null,null,{"$f":"IF(B347=\"\",\"\",INDEX('Units and Spaces'!C:C,MATCH(Observations!B347,'Units and Spaces'!B:B,0)))","v":""},null,null,"",null,null,null,null,null,"","",false,{"$f":"INDEX(EWEMs!$E$5:$E$24,MATCH(D347,EWEMs!$W$5:$W$24,0))","v":{"$error":"#N/A"}},"not bath","not kitchen",{"$error":"#VALUE!"},{"$f":"VLOOKUP(Observations!R347,EWEMs!$B$5:$D$24,3,FALSE)","v":{"$error":"#VALUE!"}}]
[null,null,{"$f":"IF(B348=\"\",\"\",INDEX('Units and Spaces'!C:C,MATCH(Observations!B348,'Units and Spaces'!B:B,0)))","v":""},null,null,"",null,null,null,null,null,"","",false,{"$f":"INDEX(EWEMs!$E$5:$E$24,MATCH(D348,EWEMs!$W$5:$W$24,0))","v":{"$error":"#N/A"}},"not bath","not kitchen",{"$error":"#VALUE!"},{"$f":"VLOOKUP(Observations!R348,EWEMs!$B$5:$D$24,3,FALSE)","v":{"$error":"#VALUE!"}}]
[null,null,{"$f":"IF(B349=\"\",\"\",INDEX('Units and Spaces'!C:C,MATCH(Observations!B349,'Units and Spaces'!B:B,0)))","v":""},null,null,"",null,null,null,null,null,"","",false,{"$f":"INDEX(EWEMs!$E$5:$E$24,MATCH(D349,EWEMs!$W$5:$W$24,0))","v":{"$error":"#N/A"}},"not bath","not kitchen",{"$error":"#VALUE!"},{"$f":"VLOOKUP(Observations!R349,EWEMs!$B$5:$D$24,3,FALSE)","v":{"$error":"#VALUE!"}}]
[null,null,{"$f":"IF(B350=\"\",\"\",INDEX('Units and Spaces'!C:C,MATCH(Observations!B350,'Units and Spaces'!B:B,0)))","v":""},null,null,"",null,null,null,null,null,"","",false,{"$f":"INDEX(EWEMs!$E$5:$E$24,MATCH(D350,EWEMs!$W$5:$W$24,0))","v":{"$error":"#N/A"}},"not bath","not kitchen",{"$error":"#VALUE!"},{"$f":"VLOOKUP(Observations!R350,EWEMs!$B$5:$D$24,3,FALSE)","v":{"$error":"#VALUE!"}}]
[null,null,{"$f":"IF(B351=\"\",\"\",INDEX('Units and Spaces'!C:C,MATCH(Observations!B351,'Units and Spaces'!B:B,0)))","v":""},null,null,"",null,null,null,null,null,"","",false,{"$f":"INDEX(EWEMs!$E$5:$E$24,MATCH(D351,EWEMs!$W$5:$W$24,0))","v":{"$error":"#N/A"}},"not bath","not kitchen",{"$error":"#VALUE!"},{"$f":"VLOOKUP(Observations!R351,EWEMs!$B$5:$D$24,3,FALSE)","v":{"$error":"#VALUE!"}}]
[null,null,{"$f":"IF(B352=\"\",\"\",INDEX('Units and Spaces'!C:C,MATCH(Observations!B352,'Units and Spaces'!B:B,0)))","v":""},null,null,"",null,null,null,null,null,"","",false,{"$f":"INDEX(EWEMs!$E$5:$E$24,MATCH(D352,EWEMs!$W$5:$W$24,0))","v":{"$error":"#N/A"}},"not bath","not kitchen",{"$error":"#VALUE!"},{"$f":"VLOOKUP(Observations!R352,EWEMs!$B$5:$D$24,3,FALSE)","v":{"$error":"#VALUE!"}}]
[null,null,{"$f":"IF(B353=\"\",\"\",INDEX('Units and Spaces'!C:C,MATCH(Observations!B353,'Units and Spaces'!B:B,0)))","v":""},null,null,"",null,null,null,null,null,"","",false,{"$f":"INDEX(EWEMs!$E$5:$E$24,MATCH(D353,EWEMs!$W$5:$W$24,0))","v":{"$error":"#N/A"}},"not bath","not kitchen",{"$error":"#VALUE!"},{"$f":"VLOOKUP(Observations!R353,EWEMs!$B$5:$D$24,3,FALSE)","v":{"$error":"#VALUE!"}}]
[null,null,{"$f":"IF(B354=\"\",\"\",INDEX('Units and Spaces'!C:C,MATCH(Observations!B354,'Units and Spaces'!B:B,0)))","v":""},null,null,"",null,null,null,null,null,"","",false,{"$f":"INDEX(EWEMs!$E$5:$E$24,MATCH(D354,EWEMs!$W$5:$W$24,0))","v":{"$error":"#N/A"}},"not bath","not kitchen",{"$error":"#VALUE!"},{"$f":"VLOOKUP(Observations!R354,EWEMs!$B$5:$D$24,3,FALSE)","v":{"$error":"#VALUE!"}}]
[null,null,{"$f":"IF(B355=\"\",\"\",INDEX('Units and Spaces'!C:C,MATCH(Observations!B355,'Units and Spaces'!B:B,0)))","v":""},null,null,"",null,null,null,null,null,"","",false,{"$f":"INDEX(EWEMs!$E$5:$E$24,MATCH(D355,EWEMs!$W$5:$W$24,0))","v":{"$error":"#N/A"}},"not bath","not kitchen",{"$error":"#VALUE!"},{"$f":"VLOOKUP(Observations!R355,EWEMs!$B$5:$D$24,3,FALSE)","v":{"$error":"#VALUE!"}}]
[null,null,{"$f":"IF(B356=\"\",\"\",INDEX('Units and Spaces'!C:C,MATCH(Observations!B356,'Units and Spaces'!B:B,0)))","v":""},null,null,"",null,null,null,null,null,"","",false,{"$f":"INDEX(EWEMs!$E$5:$E$24,MATCH(D356,EWEMs!$W$5:$W$24,0))","v":{"$error":"#N/A"}},"not bath","not kitchen",{"$error":"#VALUE!"},{"$f":"VLOOKUP(Observations!R356,EWEMs!$B$5:$D$24,3,FALSE)","v":{"$error":"#VALUE!"}}]
[null,null,{"$f":"IF(B357=\"\",\"\",INDEX('Units and Spaces'!C:C,MATCH(Observations!B357,'Units and Spaces'!B:B,0)))","v":""},null,null,"",null,null,null,null,null,"","",false,{"$f":"INDEX(EWEMs!$E$5:$E$24,MATCH(D357,EWEMs!$W$5:$W$24,0))","v":{"$error":"#N/A"}},"not bath","not kitchen",{"$error":"#VALUE!"},{"$f":"VLOOKUP(Observations!R357,EWEMs!$B$5:$D$24,3,FALSE)","v":{"$error":"#VALUE!"}}]
[null,null,{"$f":"IF(B358=\"\",\"\",INDEX('Units and Spaces'!C:C,MATCH(Observations!B358,'Units and Spaces'!B:B,0)))","v":""},null,null,"",null,null,null,null,null,"","",false,{"$f":"INDEX(EWEMs!$E$5:$E$24,MATCH(D358,EWEMs!$W$5:$W$24,0))","v":{"$error":"#N/A"}},"not bath","not kitchen",{"$error":"#VALUE!"},{"$f":"VLOOKUP(Observations!R358,EWEMs!$B$5:$D$24,3,FALSE)","v":{"$error":"#VALUE!"}}]
[null,null,{"$f":"IF(B359=\"\",\"\",INDEX('Units and Spaces'!C:C,MATCH(Observations!B359,'Units and Spaces'!B:B,0)))","v":""},null,null,"",null,null,null,null,null,"","",false,{"$f":"INDEX(EWEMs!$E$5:$E$24,MATCH(D359,EWEMs!$W$5:$W$24,0))","v":{"$error":"#N/A"}},"not bath","not kitchen",{"$error":"#VALUE!"},{"$f":"VLOOKUP(Observations!R359,EWEMs!$B$5:$D$24,3,FALSE)","v":{"$error":"#VALUE!"}}]
[null,null,{"$f":"IF(B360=\"\",\"\",INDEX('Units and Spaces'!C:C,MATCH(Observations!B360,'Units and Spaces'!B:B,0)))","v":""},null,null,"",null,null,null,null,null,"","",false,{"$f":"INDEX(EWEMs!$E$5:$E$24,MATCH(D360,EWEMs!$W$5:$W$24,0))","v":{"$error":"#N/A"}},"not bath","not kitchen",{"$error":"#VALUE!"},{"$f":"VLOOKUP(Observations!R360,EWEMs!$B$5:$D$24,3,FALSE)","v":{"$error":"#VALUE!"}}]
[null,null,{"$f":"IF(B361=\"\",\"\",INDEX('Units and Spaces'!C:C,MATCH(Observations!B361,'Units and Spaces'!B:B,0)))","v":""},null,null,"",null,null,null,null,null,"","",false,{"$f":"INDEX(EWEMs!$E$5:$E$24,MATCH(D361,EWEMs!$W$5:$W$24,0))","v":{"$error":"#N/A"}},"not bath","not kitchen",{"$error":"#VALUE!"},{"$f":"VLOOKUP(Observations!R361,EWEMs!$B$5:$D$24,3,FALSE)","v":{"$error":"#VALUE!"}}]
[null,null,{"$f":"IF(B362=\"\",\"\",INDEX('Units and Spaces'!C:C,MATCH(Observations!B362,'Units and Spaces'!B:B,0)))","v":""},null,null,"",null,null,null,null,null,"","",false,{"$f":"INDEX(EWEMs!$E$5:$E$24,MATCH(D362,EWEMs!$W$5:$W$24,0))","v":{"$error":"#N/A"}},"not bath","not kitchen",{"$error":"#VALUE!"},{"$f":"VLOOKUP(Observations!R362,EWEMs!$B$5:$D$24,3,FALSE)","v":{"$error":"#VALUE!"}}]
[null,null,{"$f":"IF(B363=\"\",\"\",INDEX('Units and Spaces'!C:C,MATCH(Observations!B363,'Units and Spaces'!B:B,0)))","v":""},null,null,"",null,null,null,null,null,"","",false,{"$f":"INDEX(EWEMs!$E$5:$E$24,MATCH(D363,EWEMs!$W$5:$W$24,0))","v":{"$error":"#N/A"}},"not bath","not kitchen",{"$error":"#VALUE!"},{"$f":"VLOOKUP(Observations!R363,EWEMs!$B$5:$D$24,3,FALSE)","v":{"$error":"#VALUE!"}}]
[null,null,{"$f":"IF(B364=\"\",\"\",INDEX('Units and Spaces'!C:C,MATCH(Observations!B364,'Units and Spaces'!B:B,0)))","v":""},null,null,"",null,null,null,null,null,"","",false,{"$f":"INDEX(EWEMs!$E$5:$E$24,MATCH(D364,EWEMs!$W$5:$W$24,0))","v":{"$error":"#N/A"}},"not bath","not kitchen",{"$error":"#VALUE!"},{"$f":"VLOOKUP(Observations!R364,EWEMs!$B$5:$D$24,3,FALSE)","v":{"$error":"#VALUE!"}}]
[null,null,{"$f":"IF(B365=\"\",\"\",INDEX('Units and Spaces'!C:C,MATCH(Observations!B365,'Units and Spaces'!B:B,0)))","v":""},null,null,"",null,null,null,null,null,"","",false,{"$f":"INDEX(EWEMs!$E$5:$E$24,MATCH(D365,EWEMs!$W$5:$W$24,0))","v":{"$error":"#N/A"}},"not bath","not kitchen",{"$error":"#VALUE!"},{"$f":"VLOOKUP(Observations!R365,EWEMs!$B$5:$D$24,3,FALSE)","v":{"$error":"#VALUE!"}}]
[null,null,{"$f":"IF(B366=\"\",\"\",INDEX('Units and Spaces'!C:C,MATCH(Observations!B366,'Units and Spaces'!B:B,0)))","v":""},null,null,"",null,null,null,null,null,"","",false,{"$f":"INDEX(EWEMs!$E$5:$E$24,MATCH(D366,EWEMs!$W$5:$W$24,0))","v":{"$error":"#N/A"}},"not bath","not kitchen",{"$error":"#VALUE!"},{"$f":"VLOOKUP(Observations!R366,EWEMs!$B$5:$D$24,3,FALSE)","v":{"$error":"#VALUE!"}}]
[null,null,{"$f":"IF(B367=\"\",\"\",INDEX('Units and Spaces'!C:C,MATCH(Observations!B367,'Units and Spaces'!B:B,0)))","v":""},null,null,"",null,null,null,null,null,"","",false,{"$f":"INDEX(EWEMs!$E$5:$E$24,MATCH(D367,EWEMs!$W$5:$W$24,0))","v":{"$error":"#N/A"}},"not bath","not kitchen",{"$error":"#VALUE!"},{"$f":"VLOOKUP(Observations!R367,EWEMs!$B$5:$D$24,3,FALSE)","v":{"$error":"#VALUE!"}}]
[null,null,{"$f":"IF(B368=\"\",\"\",INDEX('Units and Spaces'!C:C,MATCH(Observations!B368,'Units and Spaces'!B:B,0)))","v":""},null,null,"",null,null,null,null,null,"","",false,{"$f":"INDEX(EWEMs!$E$5:$E$24,MATCH(D368,EWEMs!$W$5:$W$24,0))","v":{"$error":"#N/A"}},"not bath","not kitchen",{"$error":"#VALUE!"},{"$f":"VLOOKUP(Observations!R368,EWEMs!$B$5:$D$24,3,FALSE)","v":{"$error":"#VALUE!"}}]
[null,null,{"$f":"IF(B369=\"\",\"\",INDEX('Units and Spaces'!C:C,MATCH(Observations!B369,'Units and Spaces'!B:B,0)))","v":""},null,null,"",null,null,null,null,null,"","",false,{"$f":"INDEX(EWEMs!$E$5:$E$24,MATCH(D369,EWEMs!$W$5:$W$24,0))","v":{"$error":"#N/A"}},"not bath","not kitchen",{"$error":"#VALUE!"},{"$f":"VLOOKUP(Observations!R369,EWEMs!$B$5:$D$24,3,FALSE)","v":{"$error":"#VALUE!"}}]
[null,null,{"$f":"IF(B370=\"\",\"\",INDEX('Units and Spaces'!C:C,MATCH(Observations!B370,'Units and Spaces'!B:B,0)))","v":""},null,null,"",null,null,null,null,null,"","",false,{"$f":"INDEX(EWEMs!$E$5:$E$24,MATCH(D370,EWEMs!$W$5:$W$24,0))","v":{"$error":"#N/A"}},"not bath","not kitchen",{"$error":"#VALUE!"},{"$f":"VLOOKUP(Observations!R370,EWEMs!$B$5:$D$24,3,FALSE)","v":{"$error":"#VALUE!"}}]
[null,null,{"$f":"IF(B371=\"\",\"\",INDEX('Units and Spaces'!C:C,MATCH(Observations!B371,'Units and Spaces'!B:B,0)))","v":""},null,null,"",null,null,null,null,null,"","",false,{"$f":"INDEX(EWEMs!$E$5:$E$24,MATCH(D371,EWEMs!$W$5:$W$24,0))","v":{"$error":"#N/A"}},"not bath","not kitchen",{"$error":"#VALUE!"},{"$f":"VLOOKUP(Observations!R371,EWEMs!$B$5:$D$24,3,FALSE)","v":{"$error":"#VALUE!"}}]
[null,null,{"$f":"IF(B372=\"\",\"\",INDEX('Units and Spaces'!C:C,MATCH(Observations!B372,'Units and Spaces'!B:B,0)))","v":""},null,null,"",null,null,null,null,null,"","",false,{"$f":"INDEX(EWEMs!$E$5:$E$24,MATCH(D372,EWEMs!$W$5:$W$24,0))","v":{"$error":"#N/A"}},"not bath","not kitchen",{"$error":"#VALUE!"},{"$f":"VLOOKUP(Observations!R372,EWEMs!$B$5:$D$24,3,FALSE)","v":{"$error":"#VALUE!"}}]
[null,null,{"$f":"IF(B373=\"\",\"\",INDEX('Units and Spaces'!C:C,MATCH(Observations!B373,'Units and Spaces'!B:B,0)))","v":""},null,null,"",null,null,null,null,null,"","",false,{"$f":"INDEX(EWEMs!$E$5:$E$24,MATCH(D373,EWEMs!$W$5:$W$24,0))","v":{"$error":"#N/A"}},"not bath","not kitchen",{"$error":"#VALUE!"},{"$f":"VLOOKUP(Observations!R373,EWEMs!$B$5:$D$24,3,FALSE)","v":{"$error":"#VALUE!"}}]
[null,null,{"$f":"IF(B374=\"\",\"\",INDEX('Units and Spaces'!C:C,MATCH(Observations!B374,'Units and Spaces'!B:B,0)))","v":""},null,null,"",null,null,null,null,null,"","",false,{"$f":"INDEX(EWEMs!$E$5:$E$24,MATCH(D374,EWEMs!$W$5:$W$24,0))","v":{"$error":"#N/A"}},"not bath","not kitchen",{"$error":"#VALUE!"},{"$f":"VLOOKUP(Observations!R374,EWEMs!$B$5:$D$24,3,FALSE)","v":{"$error":"#VALUE!"}}]
[null,null,{"$f":"IF(B375=\"\",\"\",INDEX('Units and Spaces'!C:C,MATCH(Observations!B375,'Units and Spaces'!B:B,0)))","v":""},null,null,"",null,null,null,null,null,"","",false,{"$f":"INDEX(EWEMs!$E$5:$E$24,MATCH(D375,EWEMs!$W$5:$W$24,0))","v":{"$error":"#N/A"}},"not bath","not kitchen",{"$error":"#VALUE!"},{"$f":"VLOOKUP(Observations!R375,EWEMs!$B$5:$D$24,3,FALSE)","v":{"$error":"#VALUE!"}}]
[null,null,{"$f":"IF(B376=\"\",\"\",INDEX('Units and Spaces'!C:C,MATCH(Observations!B376,'Units and Spaces'!B:B,0)))","v":""},null,null,"",null,null,null,null,null,"","",false,{"$f":"INDEX(EWEMs!$E$5:$E$24,MATCH(D376,EWEMs!$W$5:$W$24,0))","v":{"$error":"#N/A"}},"not bath","not kitchen",{"$error":"#VALUE!"},{"$f":"VLOOKUP(Observations!R376,EWEMs!$B$5:$D$24,3,FALSE)","v":{"$error":"#VALUE!"}}]
[null,null,{"$f":"IF(B377=\"\",\"\",INDEX('Units and Spaces'!C:C,MATCH(Observations!B377,'Units and Spaces'!B:B,0)))","v":""},null,null,"",null,null,null,null,null,"","",false,{"$f":"INDEX(EWEMs!$E$5:$E$24,MATCH(D377,EWEMs!$W$5:$W$24,0))","v":{"$error":"#N/A"}},"not bath","not kitchen",{"$error":"#VALUE!"},{"$f":"VLOOKUP(Observations!R377,EWEMs!$B$5:$D$24,3,FALSE)","v":{"$error":"#VALUE!"}}]
[null,null,{"$f":"IF(B378=\"\",\"\",INDEX('Units and Spaces'!C:C,MATCH(Observations!B378,'Units and Spaces'!B:B,0)))","v":""},null,null,"",null,null,null,null,null,"","",false,{"$f":"INDEX(EWEMs!$E$5:$E$24,MATCH(D378,EWEMs!$W$5:$W$24,0))","v":{"$error":"#N/A"}},"not bath","not kitchen",{"$error":"#VALUE!"},{"$f":"VLOOKUP(Observations!R378,EWEMs!$B$5:$D$24,3,FALSE)","v":{"$error":"#VALUE!"}}]
[null,null,{"$f":"IF(B379=\"\",\"\",INDEX('Units and Spaces'!C:C,MATCH(Observations!B379,'Units and Spaces'!B:B,0)))","v":""},null,null,"",null,null,null,null,null,"","",false,{"$f":"INDEX(EWEMs!$E$5:$E$24,MATCH(D379,EWEMs!$W$5:$W$24,0))","v":{"$error":"#N/A"}},"not bath","not kitchen",{"$error":"#VALUE!"},{"$f":"VLOOKUP(Observations!R379,EWEMs!$B$5:$D$24,3,FALSE)","v":{"$error":"#VALUE!"}}]
[null,null,{"$f":"IF(B380=\"\",\"\",INDEX('Units and Spaces'!C:C,MATCH(Observations!B380,'Units and Spaces'!B:B,0)))","v":""},null,null,"",null,null,null,null,null,"","",false,{"$f":"INDEX(EWEMs!$E$5:$E$24,MATCH(D380,EWEMs!$W$5:$W$24,0))","v":{"$error":"#N/A"}},"not bath","not kitchen",{"$error":"#VALUE!"},{"$f":"VLOOKUP(Observations!R380,EWEMs!$B$5:$D$24,3,FALSE)","v":{"$error":"#VALUE!"}}]
[null,null,{"$f":"IF(B381=\"\",\"\",INDEX('Units and Spaces'!C:C,MATCH(Observations!B381,'Units and Spaces'!B:B,0)))","v":""},null,null,"",null,null,null,null,null,"","",false,{"$f":"INDEX(EWEMs!$E$5:$E$24,MATCH(D381,EWEMs!$W$5:$W$24,0))","v":{"$error":"#N/A"}},"not bath","not kitchen",{"$error":"#VALUE!"},{"$f":"VLOOKUP(Observations!R381,EWEMs!$B$5:$D$24,3,FALSE)","v":{"$error":"#VALUE!"}}]
[null,null,{"$f":"IF(B382=\"\",\"\",INDEX('Units and Spaces'!C:C,MATCH(Observations!B382,'Units and Spaces'!B:B,0)))","v":""},null,null,"",null,null,null,null,null,"","",false,{"$f":"INDEX(EWEMs!$E$5:$E$24,MATCH(D382,EWEMs!$W$5:$W$24,0))","v":{"$error":"#N/A"}},"not bath","not kitchen",{"$error":"#VALUE!"},{"$f":"VLOOKUP(Observations!R382,EWEMs!$B$5:$D$24,3,FALSE)","v":{"$error":"#VALUE!"}}]
[null,null,{"$f":"IF(B383=\"\",\"\",INDEX('Units and Spaces'!C:C,MATCH(Observations!B383,'Units and Spaces'!B:B,0)))","v":""},null,null,"",null,null,null,null,null,"","",false,{"$f":"INDEX(EWEMs!$E$5:$E$24,MATCH(D383,EWEMs!$W$5:$W$24,0))","v":{"$error":"#N/A"}},"not bath","not kitchen",{"$error":"#VALUE!"},{"$f":"VLOOKUP(Observations!R383,EWEMs!$B$5:$D$24,3,FALSE)","v":{"$error":"#VALUE!"}}]
[null,null,{"$f":"IF(B384=\"\",\"\",INDEX('Units and Spaces'!C:C,MATCH(Observations!B384,'Units and Spaces'!B:B,0)))","v":""},null,null,"",null,null,null,null,null,"","",false,{"$f":"INDEX(EWEMs!$E$5:$E$24,MATCH(D384,EWEMs!$W$5:$W$24,0))","v":{"$error":"#N/A"}},"not bath","not kitchen",{"$error":"#VALUE!"},{"$f":"VLOOKUP(Observations!R384,EWEMs!$B$5:$D$24,3,FALSE)","v":{"$error":"#VALUE!"}}]
[null,null,{"$f":"IF(B385=\"\",\"\",INDEX('Units and Spaces'!C:C,MATCH(Observations!B385,'Units and Spaces'!B:B,0)))","v":""},null,null,"",null,null,null,null,null,"","",false,{"$f":"INDEX(EWEMs!$E$5:$E$24,MATCH(D385,EWEMs!$W$5:$W$24,0))","v":{"$error":"#N/A"}},"not bath","not kitchen",{"$error":"#VALUE!"},{"$f":"VLOOKUP(Observations!R385,EWEMs!$B$5:$D$24,3,FALSE)","v":{"$error":"#VALUE!"}}]
[null,null,{"$f":"IF(B386=\"\",\"\",INDEX('Units and Spaces'!C:C,MATCH(Observations!B386,'Units and Spaces'!B:B,0)))","v":""},null,null,"",null,null,null,null,null,"","",false,{"$f":"INDEX(EWEMs!$E$5:$E$24,MATCH(D386,EWEMs!$W$5:$W$24,0))","v":{"$error":"#N/A"}},"not bath","not kitchen",{"$error":"#VALUE!"},{"$f":"VLOOKUP(Observations!R386,EWEMs!$B$5:$D$24,3,FALSE)","v":{"$error":"#VALUE!"}}]
[null,null,{"$f":"IF(B387=\"\",\"\",INDEX('Units and Spaces'!C:C,MATCH(Observations!B387,'Units and Spaces'!B:B,0)))","v":""},null,null,"",null,null,null,null,null,"","",false,{"$f":"INDEX(EWEMs!$E$5:$E$24,MATCH(D387,EWEMs!$W$5:$W$24,0))","v":{"$error":"#N/A"}},"not bath","not kitchen",{"$error":"#VALUE!"},{"$f":"VLOOKUP(Observations!R387,EWEMs!$B$5:$D$24,3,FALSE)","v":{"$error":"#VALUE!"}}]
[null,null,{"$f":"IF(B388=\"\",\"\",INDEX('Units and Spaces'!C:C,MATCH(Observations!B388,'Units and Spaces'!B:B,0)))","v":""},null,null,"",null,null,null,null,null,"","",false,{"$f":"INDEX(EWEMs!$E$5:$E$24,MATCH(D388,EWEMs!$W$5:$W$24,0))","v":{"$error":"#N/A"}},"not bath","not kitchen",{"$error":"#VALUE!"},{"$f":"VLOOKUP(Observations!R388,EWEMs!$B$5:$D$24,3,FALSE)","v":{"$error":"#VALUE!"}}]
[null,null,{"$f":"IF(B389=\"\",\"\",INDEX('Units and Spaces'!C:C,MATCH(Observations!B389,'Units and Spaces'!B:B,0)))","v":""},null,null,"",null,null,null,null,null,"","",false,{"$f":"INDEX(EWEMs!$E$5:$E$24,MATCH(D389,EWEMs!$W$5:$W$24,0))","v":{"$error":"#N/A"}},"not bath","not kitchen",{"$error":"#VALUE!"},{"$f":"VLOOKUP(Observations!R389,EWEMs!$B$5:$D$24,3,FALSE)","v":{"$error":"#VALUE!"}}]
[null,null,{"$f":"IF(B390=\"\",\"\",INDEX('Units and Spaces'!C:C,MATCH(Observations!B390,'Units and Spaces'!B:B,0)))","v":""},null,null,"",null,null,null,null,null,"","",false,{"$f":"INDEX(EWEMs!$E$5:$E$24,MATCH(D390,EWEMs!$W$5:$W$24,0))","v":{"$error":"#N/A"}},"not bath","not kitchen",{"$error":"#VALUE!"},{"$f":"VLOOKUP(Observations!R390,EWEMs!$B$5:$D$24,3,FALSE)","v":{"$error":"#VALUE!"}}]
[null,null,{"$f":"IF(B391=\"\",\"\",INDEX('Units and Spaces'!C:C,MATCH(Observations!B391,'Units and Spaces'!B:B,0)))","v":""},null,null,"",null,null,null,null,null,"","",false,{"$f":"INDEX(EWEMs!$E$5:$E$24,MATCH(D391,EWEMs!$W$5:$W$24,0))","v":{"$error":"#N/A"}},"not bath","not kitchen",{"$error":"#VALUE!"},{"$f":"VLOOKUP(Observations!R391,EWEMs!$B$5:$D$24,3,FALSE)","v":{"$error":"#VALUE!"}}]
[null,null,{"$f":"IF(B392=\"\",\"\",INDEX('Units and Spaces'!C:C,MATCH(Observations!B392,'Units and Spaces'!B:B,0)))","v":""},null,null,{"$f":"IF(AND(N392=TRUE,E392<>\"\"), IF(ISNUMBER(SEARCH(\"compliant\", P392)),P392,IF(ISNUMBER(SEARCH(\"compliant\",Q392)),Q392,IF(E392<=O392,\"compliant\",\"noncompliant\"))),\"\")","v":""},null,null,null,null,null,{"$f":"IF(OR(F392=\"compliant\",F392=\"noncompliant\"),D392&F392,D392&G392)","v":""},{"$f":"IF(C392=\"Apartment\",IF(B392=0,\"\",B392),\"\")","v":""},{"$f":"IF(OR(ISNUMBER(FIND(\"low-flow\",D392,1)), ISNUMBER(FIND(\"low-flush\",D392,1))),TRUE,FALSE)","v":false},{"$f":"INDEX(EWEMs!$E$5:$E$24,MATCH(D392,EWEMs!$W$5:$W$24,0))","v":{"$error":"#N/A"}},{"$f":"IF(OR(ISNUMBER(SEARCH(\"bath faucets\", D392)), AND( ISNUMBER(SEARCH(\"fixture\", D392)),ISNUMBER(SEARCH(\"bath\", S392)) )), IF(O392<=1, IF(AND(E392>=O392, E392<=1), \"compliant\", \"noncompliant\"), IF(AND(E392>=1, E392<=O392),\"compliant\",\"noncompliant\")), \"not bath\"\n)","v":"not bath"},{"$f":"IF(OR(ISNUMBER(SEARCH(\"kitchen faucets\", D392)), AND(ISNUMBER(SEARCH(\"fixtures\", D392)),ISNUMBER(SEARCH(\"kitchen\", S392)) )), IF(O392<=1.5, IF(AND(E392>=O392, E392<=1.5), \"compliant\", \"noncompliant\"), IF(AND(E392>=1.5, E392<=O392),\"compliant\",\"noncompliant\")), \"not kitchen\"\n)","v":"not kitchen"},{"$f":"LEFT(D392,(FIND(\" \",D392,1)-1))*1","v":{"$error":"#VALUE!"}},{"$f":"VLOOKUP(Observations!R392,EWEMs!$B$5:$D$24,3,FALSE)","v":{"$error":"#VALUE!"}}]
[null,null,{"$f":"IF(B393=\"\",\"\",INDEX('Units and Spaces'!C:C,MATCH(Observations!B393,'Units and Spaces'!B:B,0)))","v":""},null,null,"",null,null,null,null,null,"","",false,{"$f":"INDEX(EWEMs!$E$5:$E$24,MATCH(D393,EWEMs!$W$5:$W$24,0))","v":{"$error":"#N/A"}},"not bath","not kitchen",{"$error":"#VALUE!"},{"$f":"VLOOKUP(Observations!R393,EWEMs!$B$5:$D$24,3,FALSE)","v":{"$error":"#VALUE!"}}]
[null,null,{"$f":"IF(B394=\"\",\"\",INDEX('Units and Spaces'!C:C,MATCH(Observations!B394,'Units and Spaces'!B:B,0)))","v":""},null,null,"",null,null,null,null,null,"","",false,{"$f":"INDEX(EWEMs!$E$5:$E$24,MATCH(D394,EWEMs!$W$5:$W$24,0))","v":{"$error":"#N/A"}},"not bath","not kitchen",{"$error":"#VALUE!"},{"$f":"VLOOKUP(Observations!R394,EWEMs!$B$5:$D$24,3,FALSE)","v":{"$error":"#VALUE!"}}]
[null,null,{"$f":"IF(B395=\"\",\"\",INDEX('Units and Spaces'!C:C,MATCH(Observations!B395,'Units and Spaces'!B:B,0)))","v":""},null,null,"",null,null,null,null,null,"","",false,{"$f":"INDEX(EWEMs!$E$5:$E$24,MATCH(D395,EWEMs!$W$5:$W$24,0))","v":{"$error":"#N/A"}},"not bath","not kitchen",{"$error":"#VALUE!"},{"$f":"VLOOKUP(Observations!R395,EWEMs!$B$5:$D$24,3,FALSE)","v":{"$error":"#VALUE!"}}]
[null,null,{"$f":"IF(B396=\"\",\"\",INDEX('Units and Spaces'!C:C,MATCH(Observations!B396,'Units and Spaces'!B:B,0)))","v":""},null,null,"",null,null,null,null,null,"","",false,{"$f":"INDEX(EWEMs!$E$5:$E$24,MATCH(D396,EWEMs!$W$5:$W$24,0))","v":{"$error":"#N/A"}},"not bath","not kitchen",{"$error":"#VALUE!"},{"$f":"VLOOKUP(Observations!R396,EWEMs!$B$5:$D$24,3,FALSE)","v":{"$error":"#VALUE!"}}]
[null,null,{"$f":"IF(B397=\"\",\"\",INDEX('Units and Spaces'!C:C,MATCH(Observations!B397,'Units and Spaces'!B:B,0)))","v":""},null,null,"",null,null,null,null,null,"","",false,{"$f":"INDEX(EWEMs!$E$5:$E$24,MATCH(D397,EWEMs!$W$5:$W$24,0))","v":{"$error":"#N/A"}},"not bath","not kitchen",{"$error":"#VALUE!"},{"$f":"VLOOKUP(Observations!R397,EWEMs!$B$5:$D$24,3,FALSE)","v":{"$error":"#VALUE!"}}]
[null,null,{"$f":"IF(B398=\"\",\"\",INDEX('Units and Spaces'!C:C,MATCH(Observations!B398,'Units and Spaces'!B:B,0)))","v":""},null,null,"",null,null,null,null,null,"","",false,{"$f":"INDEX(EWEMs!$E$5:$E$24,MATCH(D398,EWEMs!$W$5:$W$24,0))","v":{"$error":"#N/A"}},"not bath","not kitchen",{"$error":"#VALUE!"},{"$f":"VLOOKUP(Observations!R398,EWEMs!$B$5:$D$24,3,FALSE)","v":{"$error":"#VALUE!"}}]
[null,null,{"$f":"IF(B399=\"\",\"\",INDEX('Units and Spaces'!C:C,MATCH(Observations!B399,'Units and Spaces'!B:B,0)))","v":""},null,null,"",null,null,null,null,null,"","",false,{"$f":"INDEX(EWEMs!$E$5:$E$24,MATCH(D399,EWEMs!$W$5:$W$24,0))","v":{"$error":"#N/A"}},"not bath","not kitchen",{"$error":"#VALUE!"},{"$f":"VLOOKUP(Observations!R399,EWEMs!$B$5:$D$24,3,FALSE)","v":{"$error":"#VALUE!"}}]
[null,null,{"$f":"IF(B400=\"\",\"\",INDEX('Units and Spaces'!C:C,MATCH(Observations!B400,'Units and Spaces'!B:B,0)))","v":""},null,null,"",null,null,null,null,null,"","",false,{"$f":"INDEX(EWEMs!$E$5:$E$24,MATCH(D400,EWEMs!$W$5:$W$24,0))","v":{"$error":"#N/A"}},"not bath","not kitchen",{"$error":"#VALUE!"},{"$f":"VLOOKUP(Observations!R400,EWEMs!$B$5:$D$24,3,FALSE)","v":{"$error":"#VALUE!"}}]
[null,null,{"$f":"IF(B401=\"\",\"\",INDEX('Units and Spaces'!C:C,MATCH(Observations!B401,'Units and Spaces'!B:B,0)))","v":""},null,null,"",null,null,null,null,null,"","",false,{"$f":"INDEX(EWEMs!$E$5:$E$24,MATCH(D401,EWEMs!$W$5:$W$24,0))","v":{"$error":"#N/A"}},"not bath","not kitchen",{"$error":"#VALUE!"},{"$f":"VLOOKUP(Observations!R401,EWEMs!$B$5:$D$24,3,FALSE)","v":{"$error":"#VALUE!"}}]
[null,null,{"$f":"IF(B402=\"\",\"\",INDEX('Units and Spaces'!C:C,MATCH(Observations!B402,'Units and Spaces'!B:B,0)))","v":""},null,null,"",null,null,null,null,null,"","",false,{"$f":"INDEX(EWEMs!$E$5:$E$24,MATCH(D402,EWEMs!$W$5:$W$24,0))","v":{"$error":"#N/A"}},"not bath","not kitchen",{"$error":"#VALUE!"},{"$f":"VLOOKUP(Observations!R402,EWEMs!$B$5:$D$24,3,FALSE)","v":{"$error":"#VALUE!"}}]
[null,null,{"$f":"IF(B403=\"\",\"\",INDEX('Units and Spaces'!C:C,MATCH(Observations!B403,'Units and Spaces'!B:B,0)))","v":""},null,null,"",null,null,null,null,null,"","",false,{"$f":"INDEX(EWEMs!$E$5:$E$24,MATCH(D403,EWEMs!$W$5:$W$24,0))","v":{"$error":"#N/A"}},"not bath","not kitchen",{"$error":"#VALUE!"},{"$f":"VLOOKUP(Observations!R403,EWEMs!$B$5:$D$24,3,FALSE)","v":{"$error":"#VALUE!"}}]
[null,null,{"$f":"IF(B404=\"\",\"\",INDEX('Units and Spaces'!C:C,MATCH(Observations!B404,'Units and Spaces'!B:B,0)))","v":""},null,null,"",null,null,null,null,null,"","",false,{"$f":"INDEX(EWEMs!$E$5:$E$24,MATCH(D404,EWEMs!$W$5:$W$24,0))","v":{"$error":"#N/A"}},"not bath","not kitchen",{"$error":"#VALUE!"},{"$f":"VLOOKUP(Observations!R404,EWEMs!$B$5:$D$24,3,FALSE)","v":{"$error":"#VALUE!"}}]
[null,null,{"$f":"IF(B405=\"\",\"\",INDEX('Units and Spaces'!C:C,MATCH(Observations!B405,'Units and Spaces'!B:B,0)))","v":""},null,null,"",null,null,null,null,null,"","",false,{"$f":"INDEX(EWEMs!$E$5:$E$24,MATCH(D405,EWEMs!$W$5:$W$24,0))","v":{"$error":"#N/A"}},"not bath","not kitchen",{"$error":"#VALUE!"},{"$f":"VLOOKUP(Observations!R405,EWEMs!$B$5:$D$24,3,FALSE)","v":{"$error":"#VALUE!"}}]
[null,null,{"$f":"IF(B406=\"\",\"\",INDEX('Units and Spaces'!C:C,MATCH(Observations!B406,'Units and Spaces'!B:B,0)))","v":""},null,null,"",null,null,null,null,null,"","",false,{"$f":"INDEX(EWEMs!$E$5:$E$24,MATCH(D406,EWEMs!$W$5:$W$24,0))","v":{"$error":"#N/A"}},"not bath","not kitchen",{"$error":"#VALUE!"},{"$f":"VLOOKUP(Observations!R406,EWEMs!$B$5:$D$24,3,FALSE)","v":{"$error":"#VALUE!"}}]
[null,null,{"$f":"IF(B407=\"\",\"\",INDEX('Units and Spaces'!C:C,MATCH(Observations!B407,'Units and Spaces'!B:B,0)))","v":""},null,null,"",null,null,null,null,null,"","",false,{"$f":"INDEX(EWEMs!$E$5:$E$24,MATCH(D407,EWEMs!$W$5:$W$24,0))","v":{"$error":"#N/A"}},"not bath","not kitchen",{"$error":"#VALUE!"},{"$f":"VLOOKUP(Observations!R407,EWEMs!$B$5:$D$24,3,FALSE)","v":{"$error":"#VALUE!"}}]
[null,null,{"$f":"IF(B408=\"\",\"\",INDEX('Units and Spaces'!C:C,MATCH(Observations!B408,'Units and Spaces'!B:B,0)))","v":""},null,null,"",null,null,null,null,null,"","",false,{"$f":"INDEX(EWEMs!$E$5:$E$24,MATCH(D408,EWEMs!$W$5:$W$24,0))","v":{"$error":"#N/A"}},"not bath","not kitchen",{"$error":"#VALUE!"},{"$f":"VLOOKUP(Observations!R408,EWEMs!$B$5:$D$24,3,FALSE)","v":{"$error":"#VALUE!"}}]
[null,null,{"$f":"IF(B409=\"\",\"\",INDEX('Units and Spaces'!C:C,MATCH(Observations!B409,'Units and Spaces'!B:B,0)))","v":""},null,null,"",null,null,null,null,null,"","",false,{"$f":"INDEX(EWEMs!$E$5:$E$24,MATCH(D409,EWEMs!$W$5:$W$24,0))","v":{"$error":"#N/A"}},"not bath","not kitchen",{"$error":"#VALUE!"},{"$f":"VLOOKUP(Observations!R409,EWEMs!$B$5:$D$24,3,FALSE)","v":{"$error":"#VALUE!"}}]
[null,null,{"$f":"IF(B410=\"\",\"\",INDEX('Units and Spaces'!C:C,MATCH(Observations!B410,'Units and Spaces'!B:B,0)))","v":""},null,null,"",null,null,null,null,null,"","",false,{"$f":"INDEX(EWEMs!$E$5:$E$24,MATCH(D410,EWEMs!$W$5:$W$24,0))","v":{"$error":"#N/A"}},"not bath","not kitchen",{"$error":"#VALUE!"},{"$f":"VLOOKUP(Observations!R410,EWEMs!$B$5:$D$24,3,FALSE)","v":{"$error":"#VALUE!"}}]
[null,null,{"$f":"IF(B411=\"\",\"\",INDEX('Units and Spaces'!C:C,MATCH(Observations!B411,'Units and Spaces'!B:B,0)))","v":""},null,null,"",null,null,null,null,null,"","",false,{"$f":"INDEX(EWEMs!$E$5:$E$24,MATCH(D411,EWEMs!$W$5:$W$24,0))","v":{"$error":"#N/A"}},"not bath","not kitchen",{"$error":"#VALUE!"},{"$f":"VLOOKUP(Observations!R411,EWEMs!$B$5:$D$24,3,FALSE)","v":{"$error":"#VALUE!"}}]
[null,null,{"$f":"IF(B412=\"\",\"\",INDEX('Units and Spaces'!C:C,MATCH(Observations!B412,'Units and Spaces'!B:B,0)))","v":""},null,null,"",null,null,null,null,null,"","",false,{"$f":"INDEX(EWEMs!$E$5:$E$24,MATCH(D412,EWEMs!$W$5:$W$24,0))","v":{"$error":"#N/A"}},"not bath","not kitchen",{"$error":"#VALUE!"},{"$f":"VLOOKUP(Observations!R412,EWEMs!$B$5:$D$24,3,FALSE)","v":{"$error":"#VALUE!"}}]
[null,null,{"$f":"IF(B413=\"\",\"\",INDEX('Units and Spaces'!C:C,MATCH(Observations!B413,'Units and Spaces'!B:B,0)))","v":""},null,null,"",null,null,null,null,null,"","",false,{"$f":"INDEX(EWEMs!$E$5:$E$24,MATCH(D413,EWEMs!$W$5:$W$24,0))","v":{"$error":"#N/A"}},"not bath","not kitchen",{"$error":"#VALUE!"},{"$f":"VLOOKUP(Observations!R413,EWEMs!$B$5:$D$24,3,FALSE)","v":{"$error":"#VALUE!"}}]
[null,null,{"$f":"IF(B414=\"\",\"\",INDEX('Units and Spaces'!C:C,MATCH(Observations!B414,'Units and Spaces'!B:B,0)))","v":""},null,null,"",null,null,null,null,null,"","",false,{"$f":"INDEX(EWEMs!$E$5:$E$24,MATCH(D414,EWEMs!$W$5:$W$24,0))","v":{"$error":"#N/A"}},"not bath","not kitchen",{"$error":"#VALUE!"},{"$f":"VLOOKUP(Observations!R414,EWEMs!$B$5:$D$24,3,FALSE)","v":{"$error":"#VALUE!"}}]
[null,null,{"$f":"IF(B415=\"\",\"\",INDEX('Units and Spaces'!C:C,MATCH(Observations!B415,'Units and Spaces'!B:B,0)))","v":""},null,null,"",null,null,null,null,null,"","",false,{"$f":"INDEX(EWEMs!$E$5:$E$24,MATCH(D415,EWEMs!$W$5:$W$24,0))","v":{"$error":"#N/A"}},"not bath","not kitchen",{"$error":"#VALUE!"},{"$f":"VLOOKUP(Observations!R415,EWEMs!$B$5:$D$24,3,FALSE)","v":{"$error":"#VALUE!"}}]
[null,null,{"$f":"IF(B416=\"\",\"\",INDEX('Units and Spaces'!C:C,MATCH(Observations!B416,'Units and Spaces'!B:B,0)))","v":""},null,null,"",null,null,null,null,null,"","",false,{"$f":"INDEX(EWEMs!$E$5:$E$24,MATCH(D416,EWEMs!$W$5:$W$24,0))","v":{"$error":"#N/A"}},"not bath","not kitchen",{"$error":"#VALUE!"},{"$f":"VLOOKUP(Observations!R416,EWEMs!$B$5:$D$24,3,FALSE)","v":{"$error":"#VALUE!"}}]
[null,null,{"$f":"IF(B417=\"\",\"\",INDEX('Units and Spaces'!C:C,MATCH(Observations!B417,'Units and Spaces'!B:B,0)))","v":""},null,null,"",null,null,null,null,null,"","",false,{"$f":"INDEX(EWEMs!$E$5:$E$24,MATCH(D417,EWEMs!$W$5:$W$24,0))","v":{"$error":"#N/A"}},"not bath","not kitchen",{"$error":"#VALUE!"},{"$f":"VLOOKUP(Observations!R417,EWEMs!$B$5:$D$24,3,FALSE)","v":{"$error":"#VALUE!"}}]
[null,null,{"$f":"IF(B418=\"\",\"\",INDEX('Units and Spaces'!C:C,MATCH(Observations!B418,'Units and Spaces'!B:B,0)))","v":""},null,null,"",null,null,null,null,null,"","",false,{"$f":"INDEX(EWEMs!$E$5:$E$24,MATCH(D418,EWEMs!$W$5:$W$24,0))","v":{"$error":"#N/A"}},"not bath","not kitchen",{"$error":"#VALUE!"},{"$f":"VLOOKUP(Observations!R418,EWEMs!$B$5:$D$24,3,FALSE)","v":{"$error":"#VALUE!"}}]
[null,null,{"$f":"IF(B419=\"\",\"\",INDEX('Units and Spaces'!C:C,MATCH(Observations!B419,'Units and Spaces'!B:B,0)))","v":""},null,null,"",null,null,null,null,null,"","",false,{"$f":"INDEX(EWEMs!$E$5:$E$24,MATCH(D419,EWEMs!$W$5:$W$24,0))","v":{"$error":"#N/A"}},"not bath","not kitchen",{"$error":"#VALUE!"},{"$f":"VLOOKUP(Observations!R419,EWEMs!$B$5:$D$24,3,FALSE)","v":{"$error":"#VALUE!"}}]
[null,null,{"$f":"IF(B420=\"\",\"\",INDEX('Units and Spaces'!C:C,MATCH(Observations!B420,'Units and Spaces'!B:B,0)))","v":""},null,null,"",null,null,null,null,null,"","",false,{"$f":"INDEX(EWEMs!$E$5:$E$24,MATCH(D420,EWEMs!$W$5:$W$24,0))","v":{"$error":"#N/A"}},"not bath","not kitchen",{"$error":"#VALUE!"},{"$f":"VLOOKUP(Observations!R420,EWEMs!$B$5:$D$24,3,FALSE)","v":{"$error":"#VALUE!"}}]
[null,null,{"$f":"IF(B421=\"\",\"\",INDEX('Units and Spaces'!C:C,MATCH(Observations!B421,'Units and Spaces'!B:B,0)))","v":""},null,null,"",null,null,null,null,null,"","",false,{"$f":"INDEX(EWEMs!$E$5:$E$24,MATCH(D421,EWEMs!$W$5:$W$24,0))","v":{"$error":"#N/A"}},"not bath","not kitchen",{"$error":"#VALUE!"},{"$f":"VLOOKUP(Observations!R421,EWEMs!$B$5:$D$24,3,FALSE)","v":{"$error":"#VALUE!"}}]
[null,null,{"$f":"IF(B422=\"\",\"\",INDEX('Units and Spaces'!C:C,MATCH(Observations!B422,'Units and Spaces'!B:B,0)))","v":""},null,null,"",null,null,null,null,null,{"$f":"IF(OR(F422=\"compliant\",F422=\"noncompliant\"),D422&F422,D422&G422)","v":""},"",false,{"$f":"INDEX(EWEMs!$E$5:$E$24,MATCH(D422,EWEMs!$W$5:$W$24,0))","v":{"$error":"#N/A"}},"not bath","not kitchen",{"$error":"#VALUE!"},{"$f":"VLOOKUP(Observations!R422,EWEMs!$B$5:$D$24,3,FALSE)","v":{"$error":"#VALUE!"}}]
[null,null,{"$f":"IF(B423=\"\",\"\",INDEX('Units and Spaces'!C:C,MATCH(Observations!B423,'Units and Spaces'!B:B,0)))","v":""},null,null,"",null,null,null,null,null,{"$f":"IF(OR(F423=\"compliant\",F423=\"noncompliant\"),D423&F423,D423&G423)","v":""},"",false,{"$f":"INDEX(EWEMs!$E$5:$E$24,MATCH(D423,EWEMs!$W$5:$W$24,0))","v":{"$error":"#N/A"}},"not bath","not kitchen",{"$error":"#VALUE!"},{"$f":"VLOOKUP(Observations!R423,EWEMs!$B$5:$D$24,3,FALSE)","v":{"$error":"#VALUE!"}}]
[null,null,{"$f":"IF(B424=\"\",\"\",INDEX('Units and Spaces'!C:C,MATCH(Observations!B424,'Units and Spaces'!B:B,0)))","v":""},null,null,"",null,null,null,null,null,"","",false,{"$f":"INDEX(EWEMs!$E$5:$E$24,MATCH(D424,EWEMs!$W$5:$W$24,0))","v":{"$error":"#N/A"}},"not bath","not kitchen",{"$error":"#VALUE!"},{"$f":"VLOOKUP(Observations!R424,EWEMs!$B$5:$D$24,3,FALSE)","v":{"$error":"#VALUE!"}}]
[null,null,{"$f":"IF(B425=\"\",\"\",INDEX('Units and Spaces'!C:C,MATCH(Observations!B425,'Units and Spaces'!B:B,0)))","v":""},null,null,"",null,null,null,null,null,"","",false,{"$f":"INDEX(EWEMs!$E$5:$E$24,MATCH(D425,EWEMs!$W$5:$W$24,0))","v":{"$error":"#N/A"}},"not bath","not kitchen",{"$error":"#VALUE!"},{"$f":"VLOOKUP(Observations!R425,EWEMs!$B$5:$D$24,3,FALSE)","v":{"$error":"#VALUE!"}}]
[null,null,{"$f":"IF(B426=\"\",\"\",INDEX('Units and Spaces'!C:C,MATCH(Observations!B426,'Units and Spaces'!B:B,0)))","v":""},null,null,"",null,null,null,null,null,"","",false,{"$f":"INDEX(EWEMs!$E$5:$E$24,MATCH(D426,EWEMs!$W$5:$W$24,0))","v":{"$error":"#N/A"}},"not bath","not kitchen",{"$error":"#VALUE!"},{"$f":"VLOOKUP(Observations!R426,EWEMs!$B$5:$D$24,3,FALSE)","v":{"$error":"#VALUE!"}}]
[null,null,{"$f":"IF(B427=\"\",\"\",INDEX('Units and Spaces'!C:C,MATCH(Observations!B427,'Units and Spaces'!B:B,0)))","v":""},null,null,"",null,null,null,null,null,"","",false,{"$f":"INDEX(EWEMs!$E$5:$E$24,MATCH(D427,EWEMs!$W$5:$W$24,0))","v":{"$error":"#N/A"}},"not bath","not kitchen",{"$error":"#VALUE!"},{"$f":"VLOOKUP(Observations!R427,EWEMs!$B$5:$D$24,3,FALSE)","v":{"$error":"#VALUE!"}}]
[null,null,{"$f":"IF(B428=\"\",\"\",INDEX('Units and Spaces'!C:C,MATCH(Observations!B428,'Units and Spaces'!B:B,0)))","v":""},null,null,"",null,null,null,null,null,"","",false,{"$f":"INDEX(EWEMs!$E$5:$E$24,MATCH(D428,EWEMs!$W$5:$W$24,0))","v":{"$error":"#N/A"}},"not bath","not kitchen",{"$error":"#VALUE!"},{"$f":"VLOOKUP(Observations!R428,EWEMs!$B$5:$D$24,3,FALSE)","v":{"$error":"#VALUE!"}}]
[null,null,{"$f":"IF(B429=\"\",\"\",INDEX('Units and Spaces'!C:C,MATCH(Observations!B429,'Units and Spaces'!B:B,0)))","v":""},null,null,"",null,null,null,null,null,"","",false,{"$f":"INDEX(EWEMs!$E$5:$E$24,MATCH(D429,EWEMs!$W$5:$W$24,0))","v":{"$error":"#N/A"}},"not bath","not kitchen",{"$error":"#VALUE!"},{"$f":"VLOOKUP(Observations!R429,EWEMs!$B$5:$D$24,3,FALSE)","v":{"$error":"#VALUE!"}}]
[null,null,{"$f":"IF(B430=\"\",\"\",INDEX('Units and Spaces'!C:C,MATCH(Observations!B430,'Units and Spaces'!B:B,0)))","v":""},null,null,"",null,null,null,null,null,"","",false,{"$f":"INDEX(EWEMs!$E$5:$E$24,MATCH(D430,EWEMs!$W$5:$W$24,0))","v":{"$error":"#N/A"}},"not bath","not kitchen",{"$error":"#VALUE!"},{"$f":"VLOOKUP(Observations!R430,EWEMs!$B$5:$D$24,3,FALSE)","v":{"$error":"#VALUE!"}}]
[null,null,{"$f":"IF(B431=\"\",\"\",INDEX('Units and Spaces'!C:C,MATCH(Observations!B431,'Units and Spaces'!B:B,0)))","v":""},null,null,"",null,null,null,null,null,"","",false,{"$f":"INDEX(EWEMs!$E$5:$E$24,MATCH(D431,EWEMs!$W$5:$W$24,0))","v":{"$error":"#N/A"}},"not bath","not kitchen",{"$error":"#VALUE!"},{"$f":"VLOOKUP(Observations!R431,EWEMs!$B$5:$D$24,3,FALSE)","v":{"$error":"#VALUE!"}}]
[null,null,{"$f":"IF(B432=\"\",\"\",INDEX('Units and Spaces'!C:C,MATCH(Observations!B432,'Units and Spaces'!B:B,0)))","v":""},null,null,"",null,null,null,null,null,"","",false,{"$f":"INDEX(EWEMs!$E$5:$E$24,MATCH(D432,EWEMs!$W$5:$W$24,0))","v":{"$error":"#N/A"}},"not bath","not kitchen",{"$error":"#VALUE!"},{"$f":"VLOOKUP(Observations!R432,EWEMs!$B$5:$D$24,3,FALSE)","v":{"$error":"#VALUE!"}}]
[null,null,{"$f":"IF(B433=\"\",\"\",INDEX('Units and Spaces'!C:C,MATCH(Observations!B433,'Units and Spaces'!B:B,0)))","v":""},null,null,"",null,null,null,null,null,"","",false,{"$f":"INDEX(EWEMs!$E$5:$E$24,MATCH(D433,EWEMs!$W$5:$W$24,0))","v":{"$error":"#N/A"}},"not bath","not kitchen",{"$error":"#VALUE!"},{"$f":"VLOOKUP(Observations!R433,EWEMs!$B$5:$D$24,3,FALSE)","v":{"$error":"#VALUE!"}}]
[null,null,{"$f":"IF(B434=\"\",\"\",INDEX('Units and Spaces'!C:C,MATCH(Observations!B434,'Units and Spaces'!B:B,0)))","v":""},null,null,"",null,null,null,null,null,"","",false,{"$f":"INDEX(EWEMs!$E$5:$E$24,MATCH(D434,EWEMs!$W$5:$W$24,0))","v":{"$error":"#N/A"}},"not bath","not kitchen",{"$error":"#VALUE!"},{"$f":"VLOOKUP(Observations!R434,EWEMs!$B$5:$D$24,3,FALSE)","v":{"$error":"#VALUE!"}}]
[null,null,{"$f":"IF(B435=\"\",\"\",INDEX('Units and Spaces'!C:C,MATCH(Observations!B435,'Units and Spaces'!B:B,0)))","v":""},null,null,"",null,null,null,null,null,"","",false,{"$f":"INDEX(EWEMs!$E$5:$E$24,MATCH(D435,EWEMs!$W$5:$W$24,0))","v":{"$error":"#N/A"}},"not bath","not kitchen",{"$error":"#VALUE!"},{"$f":"VLOOKUP(Observations!R435,EWEMs!$B$5:$D$24,3,FALSE)","v":{"$error":"#VALUE!"}}]
[null,null,{"$f":"IF(B436=\"\",\"\",INDEX('Units and Spaces'!C:C,MATCH(Observations!B436,'Units and Spaces'!B:B,0)))","v":""},null,null,"",null,null,null,null,null,"","",false,{"$f":"INDEX(EWEMs!$E$5:$E$24,MATCH(D436,EWEMs!$W$5:$W$24,0))","v":{"$error":"#N/A"}},"not bath","not kitchen",{"$error":"#VALUE!"},{"$f":"VLOOKUP(Observations!R436,EWEMs!$B$5:$D$24,3,FALSE)","v":{"$error":"#VALUE!"}}]
[null,null,{"$f":"IF(B437=\"\",\"\",INDEX('Units and Spaces'!C:C,MATCH(Observations!B437,'Units and Spaces'!B:B,0)))","v":""},null,null,"",null,null,null,null,null,"","",false,{"$f":"INDEX(EWEMs!$E$5:$E$24,MATCH(D437,EWEMs!$W$5:$W$24,0))","v":{"$error":"#N/A"}},"not bath","not kitchen",{"$error":"#VALUE!"},{"$f":"VLOOKUP(Observations!R437,EWEMs!$B$5:$D$24,3,FALSE)","v":{"$error":"#VALUE!"}}]
[null,null,{"$f":"IF(B438=\"\",\"\",INDEX('Units and Spaces'!C:C,MATCH(Observations!B438,'Units and Spaces'!B:B,0)))","v":""},null,null,"",null,null,null,null,null,"","",false,{"$f":"INDEX(EWEMs!$E$5:$E$24,MATCH(D438,EWEMs!$W$5:$W$24,0))","v":{"$error":"#N/A"}},"not bath","not kitchen",{"$error":"#VALUE!"},{"$f":"VLOOKUP(Observations!R438,EWEMs!$B$5:$D$24,3,FALSE)","v":{"$error":"#VALUE!"}}]
[null,null,{"$f":"IF(B439=\"\",\"\",INDEX('Units and Spaces'!C:C,MATCH(Observations!B439,'Units and Spaces'!B:B,0)))","v":""},null,null,"",null,null,null,null,null,"","",false,{"$f":"INDEX(EWEMs!$E$5:$E$24,MATCH(D439,EWEMs!$W$5:$W$24,0))","v":{"$error":"#N/A"}},"not bath","not kitchen",{"$error":"#VALUE!"},{"$f":"VLOOKUP(Observations!R439,EWEMs!$B$5:$D$24,3,FALSE)","v":{"$error":"#VALUE!"}}]
[null,null,{"$f":"IF(B440=\"\",\"\",INDEX('Units and Spaces'!C:C,MATCH(Observations!B440,'Units and Spaces'!B:B,0)))","v":""},null,null,"",null,null,null,null,null,"","",false,{"$f":"INDEX(EWEMs!$E$5:$E$24,MATCH(D440,EWEMs!$W$5:$W$24,0))","v":{"$error":"#N/A"}},"not bath","not kitchen",{"$error":"#VALUE!"},{"$f":"VLOOKUP(Observations!R440,EWEMs!$B$5:$D$24,3,FALSE)","v":{"$error":"#VALUE!"}}]
[null,null,{"$f":"IF(B441=\"\",\"\",INDEX('Units and Spaces'!C:C,MATCH(Observations!B441,'Units and Spaces'!B:B,0)))","v":""},null,null,"",null,null,null,null,null,"","",false,{"$f":"INDEX(EWEMs!$E$5:$E$24,MATCH(D441,EWEMs!$W$5:$W$24,0))","v":{"$error":"#N/A"}},"not bath","not kitchen",{"$error":"#VALUE!"},{"$f":"VLOOKUP(Observations!R441,EWEMs!$B$5:$D$24,3,FALSE)","v":{"$error":"#VALUE!"}}]
[null,null,{"$f":"IF(B442=\"\",\"\",INDEX('Units and Spaces'!C:C,MATCH(Observations!B442,'Units and Spaces'!B:B,0)))","v":""},null,null,"",null,null,null,null,null,"","",false,{"$f":"INDEX(EWEMs!$E$5:$E$24,MATCH(D442,EWEMs!$W$5:$W$24,0))","v":{"$error":"#N/A"}},"not bath","not kitchen",{"$error":"#VALUE!"},{"$f":"VLOOKUP(Observations!R442,EWEMs!$B$5:$D$24,3,FALSE)","v":{"$error":"#VALUE!"}}]
[null,null,{"$f":"IF(B443=\"\",\"\",INDEX('Units and Spaces'!C:C,MATCH(Observations!B443,'Units and Spaces'!B:B,0)))","v":""},null,null,"",null,null,null,null,null,"","",false,{"$f":"INDEX(EWEMs!$E$5:$E$24,MATCH(D443,EWEMs!$W$5:$W$24,0))","v":{"$error":"#N/A"}},"not bath","not kitchen",{"$error":"#VALUE!"},{"$f":"VLOOKUP(Observations!R443,EWEMs!$B$5:$D$24,3,FALSE)","v":{"$error":"#VALUE!"}}]
[null,null,{"$f":"IF(B444=\"\",\"\",INDEX('Units and Spaces'!C:C,MATCH(Observations!B444,'Units and Spaces'!B:B,0)))","v":""},null,null,"",null,null,null,null,null,"","",false,{"$f":"INDEX(EWEMs!$E$5:$E$24,MATCH(D444,EWEMs!$W$5:$W$24,0))","v":{"$error":"#N/A"}},"not bath","not kitchen",{"$error":"#VALUE!"},{"$f":"VLOOKUP(Observations!R444,EWEMs!$B$5:$D$24,3,FALSE)","v":{"$error":"#VALUE!"}}]
[null,null,{"$f":"IF(B445=\"\",\"\",INDEX('Units and Spaces'!C:C,MATCH(Observations!B445,'Units and Spaces'!B:B,0)))","v":""},null,null,"",null,null,null,null,null,"","",false,{"$f":"INDEX(EWEMs!$E$5:$E$24,MATCH(D445,EWEMs!$W$5:$W$24,0))","v":{"$error":"#N/A"}},"not bath","not kitchen",{"$error":"#VALUE!"},{"$f":"VLOOKUP(Observations!R445,EWEMs!$B$5:$D$24,3,FALSE)","v":{"$error":"#VALUE!"}}]
[null,null,{"$f":"IF(B446=\"\",\"\",INDEX('Units and Spaces'!C:C,MATCH(Observations!B446,'Units and Spaces'!B:B,0)))","v":""},null,null,"",null,null,null,null,null,"","",false,{"$f":"INDEX(EWEMs!$E$5:$E$24,MATCH(D446,EWEMs!$W$5:$W$24,0))","v":{"$error":"#N/A"}},"not bath","not kitchen",{"$error":"#VALUE!"},{"$f":"VLOOKUP(Observations!R446,EWEMs!$B$5:$D$24,3,FALSE)","v":{"$error":"#VALUE!"}}]
[null,null,{"$f":"IF(B447=\"\",\"\",INDEX('Units and Spaces'!C:C,MATCH(Observations!B447,'Units and Spaces'!B:B,0)))","v":""},null,null,"",null,null,null,null,null,"","",false,{"$f":"INDEX(EWEMs!$E$5:$E$24,MATCH(D447,EWEMs!$W$5:$W$24,0))","v":{"$error":"#N/A"}},"not bath","not kitchen",{"$error":"#VALUE!"},{"$f":"VLOOKUP(Observations!R447,EWEMs!$B$5:$D$24,3,FALSE)","v":{"$error":"#VALUE!"}}]
[null,null,{"$f":"IF(B448=\"\",\"\",INDEX('Units and Spaces'!C:C,MATCH(Observations!B448,'Units and Spaces'!B:B,0)))","v":""},null,null,"",null,null,null,null,null,"","",false,{"$f":"INDEX(EWEMs!$E$5:$E$24,MATCH(D448,EWEMs!$W$5:$W$24,0))","v":{"$error":"#N/A"}},"not bath","not kitchen",{"$error":"#VALUE!"},{"$f":"VLOOKUP(Observations!R448,EWEMs!$B$5:$D$24,3,FALSE)","v":{"$error":"#VALUE!"}}]
[null,null,{"$f":"IF(B449=\"\",\"\",INDEX('Units and Spaces'!C:C,MATCH(Observations!B449,'Units and Spaces'!B:B,0)))","v":""},null,null,"",null,null,null,null,null,"","",false,{"$f":"INDEX(EWEMs!$E$5:$E$24,MATCH(D449,EWEMs!$W$5:$W$24,0))","v":{"$error":"#N/A"}},"not bath","not kitchen",{"$error":"#VALUE!"},{"$f":"VLOOKUP(Observations!R449,EWEMs!$B$5:$D$24,3,FALSE)","v":{"$error":"#VALUE!"}}]
[null,null,{"$f":"IF(B450=\"\",\"\",INDEX('Units and Spaces'!C:C,MATCH(Observations!B450,'Units and Spaces'!B:B,0)))","v":""},null,null,"",null,null,null,null,null,"","",false,{"$f":"INDEX(EWEMs!$E$5:$E$24,MATCH(D450,EWEMs!$W$5:$W$24,0))","v":{"$error":"#N/A"}},"not bath","not kitchen",{"$error":"#VALUE!"},{"$f":"VLOOKUP(Observations!R450,EWEMs!$B$5:$D$24,3,FALSE)","v":{"$error":"#VALUE!"}}]
[null,null,{"$f":"IF(B451=\"\",\"\",INDEX('Units and Spaces'!C:C,MATCH(Observations!B451,'Units and Spaces'!B:B,0)))","v":""},null,null,"",null,null,null,null,null,"","",false,{"$f":"INDEX(EWEMs!$E$5:$E$24,MATCH(D451,EWEMs!$W$5:$W$24,0))","v":{"$error":"#N/A"}},"not bath","not kitchen",{"$error":"#VALUE!"},{"$f":"VLOOKUP(Observations!R451,EWEMs!$B$5:$D$24,3,FALSE)","v":{"$error":"#VALUE!"}}]
[null,null,{"$f":"IF(B452=\"\",\"\",INDEX('Units and Spaces'!C:C,MATCH(Observations!B452,'Units and Spaces'!B:B,0)))","v":""},null,null,"",null,null,null,null,null,"","",false,{"$f":"INDEX(EWEMs!$E$5:$E$24,MATCH(D452,EWEMs!$W$5:$W$24,0))","v":{"$error":"#N/A"}},"not bath","not kitchen",{"$error":"#VALUE!"},{"$f":"VLOOKUP(Observations!R452,EWEMs!$B$5:$D$24,3,FALSE)","v":{"$error":"#VALUE!"}}]
[null,null,{"$f":"IF(B453=\"\",\"\",INDEX('Units and Spaces'!C:C,MATCH(Observations!B453,'Units and Spaces'!B:B,0)))","v":""},null,null,"",null,null,null,null,null,"","",false,{"$f":"INDEX(EWEMs!$E$5:$E$24,MATCH(D453,EWEMs!$W$5:$W$24,0))","v":{"$error":"#N/A"}},"not bath","not kitchen",{"$error":"#VALUE!"},{"$f":"VLOOKUP(Observations!R453,EWEMs!$B$5:$D$24,3,FALSE)","v":{"$error":"#VALUE!"}}]
[null,null,{"$f":"IF(B454=\"\",\"\",INDEX('Units and Spaces'!C:C,MATCH(Observations!B454,'Units and Spaces'!B:B,0)))","v":""},null,null,"",null,null,null,null,null,"","",false,{"$f":"INDEX(EWEMs!$E$5:$E$24,MATCH(D454,EWEMs!$W$5:$W$24,0))","v":{"$error":"#N/A"}},"not bath","not kitchen",{"$error":"#VALUE!"},{"$f":"VLOOKUP(Observations!R454,EWEMs!$B$5:$D$24,3,FALSE)","v":{"$error":"#VALUE!"}}]
[null,null,{"$f":"IF(B455=\"\",\"\",INDEX('Units and Spaces'!C:C,MATCH(Observations!B455,'Units and Spaces'!B:B,0)))","v":""},null,null,"",null,null,null,null,null,"","",false,{"$f":"INDEX(EWEMs!$E$5:$E$24,MATCH(D455,EWEMs!$W$5:$W$24,0))","v":{"$error":"#N/A"}},"not bath","not kitchen",{"$error":"#VALUE!"},{"$f":"VLOOKUP(Observations!R455,EWEMs!$B$5:$D$24,3,FALSE)","v":{"$error":"#VALUE!"}}]
[null,null,{"$f":"IF(B456=\"\",\"\",INDEX('Units and Spaces'!C:C,MATCH(Observations!B456,'Units and Spaces'!B:B,0)))","v":""},null,null,{"$f":"IF(AND(N456=TRUE,E456<>\"\"), IF(ISNUMBER(SEARCH(\"compliant\", P456)),P456,IF(ISNUMBER(SEARCH(\"compliant\",Q456)),Q456,IF(E456<=O456,\"compliant\",\"noncompliant\"))),\"\")","v":""},null,null,null,null,null,"",{"$f":"IF(C456=\"Apartment\",IF(B456=0,\"\",B456),\"\")","v":""},{"$f":"IF(OR(ISNUMBER(FIND(\"low-flow\",D456,1)), ISNUMBER(FIND(\"low-flush\",D456,1))),TRUE,FALSE)","v":false},{"$f":"INDEX(EWEMs!$E$5:$E$24,MATCH(D456,EWEMs!$W$5:$W$24,0))","v":{"$error":"#N/A"}},{"$f":"IF(OR(ISNUMBER(SEARCH(\"bath faucets\", D456)), AND( ISNUMBER(SEARCH(\"fixture\", D456)),ISNUMBER(SEARCH(\"bath\", S456)) )), IF(O456<=1, IF(AND(E456>=O456, E456<=1), \"compliant\", \"noncompliant\"), IF(AND(E456>=1, E456<=O456),\"compliant\",\"noncompliant\")), \"not bath\"\n)","v":"not bath"},{"$f":"IF(OR(ISNUMBER(SEARCH(\"kitchen faucets\", D456)), AND(ISNUMBER(SEARCH(\"fixtures\", D456)),ISNUMBER(SEARCH(\"kitchen\", S456)) )), IF(O456<=1.5, IF(AND(E456>=O456, E456<=1.5), \"compliant\", \"noncompliant\"), IF(AND(E456>=1.5, E456<=O456),\"compliant\",\"noncompliant\")), \"not kitchen\"\n)","v":"not kitchen"},{"$f":"LEFT(D456,(FIND(\" \",D456,1)-1))*1","v":{"$error":"#VALUE!"}},{"$f":"VLOOKUP(Observations!R456,EWEMs!$B$5:$D$24,3,FALSE)","v":{"$error":"#VALUE!"}}]
[null,null,{"$f":"IF(B457=\"\",\"\",INDEX('Units and Spaces'!C:C,MATCH(Observations!B457,'Units and Spaces'!B:B,0)))","v":""},null,null,"",null,null,null,null,null,"","",false,{"$f":"INDEX(EWEMs!$E$5:$E$24,MATCH(D457,EWEMs!$W$5:$W$24,0))","v":{"$error":"#N/A"}},"not bath","not kitchen",{"$error":"#VALUE!"},{"$f":"VLOOKUP(Observations!R457,EWEMs!$B$5:$D$24,3,FALSE)","v":{"$error":"#VALUE!"}}]
[null,null,{"$f":"IF(B458=\"\",\"\",INDEX('Units and Spaces'!C:C,MATCH(Observations!B458,'Units and Spaces'!B:B,0)))","v":""},null,null,"",null,null,null,null,null,"","",false,{"$f":"INDEX(EWEMs!$E$5:$E$24,MATCH(D458,EWEMs!$W$5:$W$24,0))","v":{"$error":"#N/A"}},"not bath","not kitchen",{"$error":"#VALUE!"},{"$f":"VLOOKUP(Observations!R458,EWEMs!$B$5:$D$24,3,FALSE)","v":{"$error":"#VALUE!"}}]
[null,null,{"$f":"IF(B459=\"\",\"\",INDEX('Units and Spaces'!C:C,MATCH(Observations!B459,'Units and Spaces'!B:B,0)))","v":""},null,null,"",null,null,null,null,null,"","",false,{"$f":"INDEX(EWEMs!$E$5:$E$24,MATCH(D459,EWEMs!$W$5:$W$24,0))","v":{"$error":"#N/A"}},"not bath","not kitchen",{"$error":"#VALUE!"},{"$f":"VLOOKUP(Observations!R459,EWEMs!$B$5:$D$24,3,FALSE)","v":{"$error":"#VALUE!"}}]
[null,null,{"$f":"IF(B460=\"\",\"\",INDEX('Units and Spaces'!C:C,MATCH(Observations!B460,'Units and Spaces'!B:B,0)))","v":""},null,null,"",null,null,null,null,null,"","",false,{"$f":"INDEX(EWEMs!$E$5:$E$24,MATCH(D460,EWEMs!$W$5:$W$24,0))","v":{"$error":"#N/A"}},"not bath","not kitchen",{"$error":"#VALUE!"},{"$f":"VLOOKUP(Observations!R460,EWEMs!$B$5:$D$24,3,FALSE)","v":{"$error":"#VALUE!"}}]
[null,null,{"$f":"IF(B461=\"\",\"\",INDEX('Units and Spaces'!C:C,MATCH(Observations!B461,'Units and Spaces'!B:B,0)))","v":""},null,null,"",null,null,null,null,null,"","",false,{"$f":"INDEX(EWEMs!$E$5:$E$24,MATCH(D461,EWEMs!$W$5:$W$24,0))","v":{"$error":"#N/A"}},"not bath","not kitchen",{"$error":"#VALUE!"},{"$f":"VLOOKUP(Observations!R461,EWEMs!$B$5:$D$24,3,FALSE)","v":{"$error":"#VALUE!"}}]
[null,null,{"$f":"IF(B462=\"\",\"\",INDEX('Units and Spaces'!C:C,MATCH(Observations!B462,'Units and Spaces'!B:B,0)))","v":""},null,null,"",null,null,null,null,null,"","",false,{"$f":"INDEX(EWEMs!$E$5:$E$24,MATCH(D462,EWEMs!$W$5:$W$24,0))","v":{"$error":"#N/A"}},"not bath","not kitchen",{"$error":"#VALUE!"},{"$f":"VLOOKUP(Observations!R462,EWEMs!$B$5:$D$24,3,FALSE)","v":{"$error":"#VALUE!"}}]
[null,null,{"$f":"IF(B463=\"\",\"\",INDEX('Units and Spaces'!C:C,MATCH(Observations!B463,'Units and Spaces'!B:B,0)))","v":""},null,null,"",null,null,null,null,null,"","",false,{"$f":"INDEX(EWEMs!$E$5:$E$24,MATCH(D463,EWEMs!$W$5:$W$24,0))","v":{"$error":"#N/A"}},"not bath","not kitchen",{"$error":"#VALUE!"},{"$f":"VLOOKUP(Observations!R463,EWEMs!$B$5:$D$24,3,FALSE)","v":{"$error":"#VALUE!"}}]
[null,null,{"$f":"IF(B464=\"\",\"\",INDEX('Units and Spaces'!C:C,MATCH(Observations!B464,'Units and Spaces'!B:B,0)))","v":""},null,null,"",null,null,null,null,null,"","",false,{"$f":"INDEX(EWEMs!$E$5:$E$24,MATCH(D464,EWEMs!$W$5:$W$24,0))","v":{"$error":"#N/A"}},"not bath","not kitchen",{"$error":"#VALUE!"},{"$f":"VLOOKUP(Observations!R464,EWEMs!$B$5:$D$24,3,FALSE)","v":{"$error":"#VALUE!"}}]
[null,null,{"$f":"IF(B465=\"\",\"\",INDEX('Units and Spaces'!C:C,MATCH(Observations!B465,'Units and Spaces'!B:B,0)))","v":""},null,null,"",null,null,null,null,null,"","",false,{"$f":"INDEX(EWEMs!$E$5:$E$24,MATCH(D465,EWEMs!$W$5:$W$24,0))","v":{"$error":"#N/A"}},"not bath","not kitchen",{"$error":"#VALUE!"},{"$f":"VLOOKUP(Observations!R465,EWEMs!$B$5:$D$24,3,FALSE)","v":{"$error":"#VALUE!"}}]
[null,null,{"$f":"IF(B466=\"\",\"\",INDEX('Units and Spaces'!C:C,MATCH(Observations!B466,'Units and Spaces'!B:B,0)))","v":""},null,null,"",null,null,null,null,null,"","",false,{"$f":"INDEX(EWEMs!$E$5:$E$24,MATCH(D466,EWEMs!$W$5:$W$24,0))","v":{"$error":"#N/A"}},"not bath","not kitchen",{"$error":"#VALUE!"},{"$f":"VLOOKUP(Observations!R466,EWEMs!$B$5:$D$24,3,FALSE)","v":{"$error":"#VALUE!"}}]
[null,null,{"$f":"IF(B467=\"\",\"\",INDEX('Units and Spaces'!C:C,MATCH(Observations!B467,'Units and Spaces'!B:B,0)))","v":""},null,null,"",null,null,null,null,null,"","",false,{"$f":"INDEX(EWEMs!$E$5:$E$24,MATCH(D467,EWEMs!$W$5:$W$24,0))","v":{"$error":"#N/A"}},"not bath","not kitchen",{"$error":"#VALUE!"},{"$f":"VLOOKUP(Observations!R467,EWEMs!$B$5:$D$24,3,FALSE)","v":{"$error":"#VALUE!"}}]
[null,null,{"$f":"IF(B468=\"\",\"\",INDEX('Units and Spaces'!C:C,MATCH(Observations!B468,'Units and Spaces'!B:B,0)))","v":""},null,null,"",null,null,null,null,null,"","",false,{"$f":"INDEX(EWEMs!$E$5:$E$24,MATCH(D468,EWEMs!$W$5:$W$24,0))","v":{"$error":"#N/A"}},"not bath","not kitchen",{"$error":"#VALUE!"},{"$f":"VLOOKUP(Observations!R468,EWEMs!$B$5:$D$24,3,FALSE)","v":{"$error":"#VALUE!"}}]
[null,null,{"$f":"IF(B469=\"\",\"\",INDEX('Units and Spaces'!C:C,MATCH(Observations!B469,'Units and Spaces'!B:B,0)))","v":""},null,null,"",null,null,null,null,null,"","",false,{"$f":"INDEX(EWEMs!$E$5:$E$24,MATCH(D469,EWEMs!$W$5:$W$24,0))","v":{"$error":"#N/A"}},"not bath","not kitchen",{"$error":"#VALUE!"},{"$f":"VLOOKUP(Observations!R469,EWEMs!$B$5:$D$24,3,FALSE)","v":{"$error":"#VALUE!"}}]
[null,null,{"$f":"IF(B470=\"\",\"\",INDEX('Units and Spaces'!C:C,MATCH(Observations!B470,'Units and Spaces'!B:B,0)))","v":""},null,null,"",null,null,null,null,null,"","",false,{"$f":"INDEX(EWEMs!$E$5:$E$24,MATCH(D470,EWEMs!$W$5:$W$24,0))","v":{"$error":"#N/A"}},"not bath","not kitchen",{"$error":"#VALUE!"},{"$f":"VLOOKUP(Observations!R470,EWEMs!$B$5:$D$24,3,FALSE)","v":{"$error":"#VALUE!"}}]
[null,null,{"$f":"IF(B471=\"\",\"\",INDEX('Units and Spaces'!C:C,MATCH(Observations!B471,'Units and Spaces'!B:B,0)))","v":""},null,null,"",null,null,null,null,null,"","",false,{"$f":"INDEX(EWEMs!$E$5:$E$24,MATCH(D471,EWEMs!$W$5:$W$24,0))","v":{"$error":"#N/A"}},"not bath","not kitchen",{"$error":"#VALUE!"},{"$f":"VLOOKUP(Observations!R471,EWEMs!$B$5:$D$24,3,FALSE)","v":{"$error":"#VALUE!"}}]
[null,null,{"$f":"IF(B472=\"\",\"\",INDEX('Units and Spaces'!C:C,MATCH(Observations!B472,'Units and Spaces'!B:B,0)))","v":""},null,null,"",null,null,null,null,null,"","",false,{"$f":"INDEX(EWEMs!$E$5:$E$24,MATCH(D472,EWEMs!$W$5:$W$24,0))","v":{"$error":"#N/A"}},"not bath","not kitchen",{"$error":"#VALUE!"},{"$f":"VLOOKUP(Observations!R472,EWEMs!$B$5:$D$24,3,FALSE)","v":{"$error":"#VALUE!"}}]
[null,null,{"$f":"IF(B473=\"\",\"\",INDEX('Units and Spaces'!C:C,MATCH(Observations!B473,'Units and Spaces'!B:B,0)))","v":""},null,null,"",null,null,null,null,null,"","",false,{"$f":"INDEX(EWEMs!$E$5:$E$24,MATCH(D473,EWEMs!$W$5:$W$24,0))","v":{"$error":"#N/A"}},"not bath","not kitchen",{"$error":"#VALUE!"},{"$f":"VLOOKUP(Observations!R473,EWEMs!$B$5:$D$24,3,FALSE)","v":{"$error":"#VALUE!"}}]
[null,null,{"$f":"IF(B474=\"\",\"\",INDEX('Units and Spaces'!C:C,MATCH(Observations!B474,'Units and Spaces'!B:B,0)))","v":""},null,null,"",null,null,null,null,null,"","",false,{"$f":"INDEX(EWEMs!$E$5:$E$24,MATCH(D474,EWEMs!$W$5:$W$24,0))","v":{"$error":"#N/A"}},"not bath","not kitchen",{"$error":"#VALUE!"},{"$f":"VLOOKUP(Observations!R474,EWEMs!$B$5:$D$24,3,FALSE)","v":{"$error":"#VALUE!"}}]
[null,null,{"$f":"IF(B475=\"\",\"\",INDEX('Units and Spaces'!C:C,MATCH(Observations!B475,'Units and Spaces'!B:B,0)))","v":""},null,null,"",null,null,null,null,null,"","",false,{"$f":"INDEX(EWEMs!$E$5:$E$24,MATCH(D475,EWEMs!$W$5:$W$24,0))","v":{"$error":"#N/A"}},"not bath","not kitchen",{"$error":"#VALUE!"},{"$f":"VLOOKUP(Observations!R475,EWEMs!$B$5:$D$24,3,FALSE)","v":{"$error":"#VALUE!"}}]
[null,null,{"$f":"IF(B476=\"\",\"\",INDEX('Units and Spaces'!C:C,MATCH(Observations!B476,'Units and Spaces'!B:B,0)))","v":""},null,null,"",null,null,null,null,null,"","",false,{"$f":"INDEX(EWEMs!$E$5:$E$24,MATCH(D476,EWEMs!$W$5:$W$24,0))","v":{"$error":"#N/A"}},"not bath","not kitchen",{"$error":"#VALUE!"},{"$f":"VLOOKUP(Observations!R476,EWEMs!$B$5:$D$24,3,FALSE)","v":{"$error":"#VALUE!"}}]
[null,null,{"$f":"IF(B477=\"\",\"\",INDEX('Units and Spaces'!C:C,MATCH(Observations!B477,'Units and Spaces'!B:B,0)))","v":""},null,null,"",null,null,null,null,null,"","",false,{"$f":"INDEX(EWEMs!$E$5:$E$24,MATCH(D477,EWEMs!$W$5:$W$24,0))","v":{"$error":"#N/A"}},"not bath","not kitchen",{"$error":"#VALUE!"},{"$f":"VLOOKUP(Observations!R477,EWEMs!$B$5:$D$24,3,FALSE)","v":{"$error":"#VALUE!"}}]
[null,null,{"$f":"IF(B478=\"\",\"\",INDEX('Units and Spaces'!C:C,MATCH(Observations!B478,'Units and Spaces'!B:B,0)))","v":""},null,null,"",null,null,null,null,null,"","",false,{"$f":"INDEX(EWEMs!$E$5:$E$24,MATCH(D478,EWEMs!$W$5:$W$24,0))","v":{"$error":"#N/A"}},"not bath","not kitchen",{"$error":"#VALUE!"},{"$f":"VLOOKUP(Observations!R478,EWEMs!$B$5:$D$24,3,FALSE)","v":{"$error":"#VALUE!"}}]
[null,null,{"$f":"IF(B479=\"\",\"\",INDEX('Units and Spaces'!C:C,MATCH(Observations!B479,'Units and Spaces'!B:B,0)))","v":""},null,null,"",null,null,null,null,null,"","",false,{"$f":"INDEX(EWEMs!$E$5:$E$24,MATCH(D479,EWEMs!$W$5:$W$24,0))","v":{"$error":"#N/A"}},"not bath","not kitchen",{"$error":"#VALUE!"},{"$f":"VLOOKUP(Observations!R479,EWEMs!$B$5:$D$24,3,FALSE)","v":{"$error":"#VALUE!"}}]
[null,null,{"$f":"IF(B480=\"\",\"\",INDEX('Units and Spaces'!C:C,MATCH(Observations!B480,'Units and Spaces'!B:B,0)))","v":""},null,null,"",null,null,null,null,null,"","",false,{"$f":"INDEX(EWEMs!$E$5:$E$24,MATCH(D480,EWEMs!$W$5:$W$24,0))","v":{"$error":"#N/A"}},"not bath","not kitchen",{"$error":"#VALUE!"},{"$f":"VLOOKUP(Observations!R480,EWEMs!$B$5:$D$24,3,FALSE)","v":{"$error":"#VALUE!"}}]
[null,null,{"$f":"IF(B481=\"\",\"\",INDEX('Units and Spaces'!C:C,MATCH(Observations!B481,'Units and Spaces'!B:B,0)))","v":""},null,null,"",null,null,null,null,null,"","",false,{"$f":"INDEX(EWEMs!$E$5:$E$24,MATCH(D481,EWEMs!$W$5:$W$24,0))","v":{"$error":"#N/A"}},"not bath","not kitchen",{"$error":"#VALUE!"},{"$f":"VLOOKUP(Observations!R481,EWEMs!$B$5:$D$24,3,FALSE)","v":{"$error":"#VALUE!"}}]
[null,null,{"$f":"IF(B482=\"\",\"\",INDEX('Units and Spaces'!C:C,MATCH(Observations!B482,'Units and Spaces'!B:B,0)))","v":""},null,null,"",null,null,null,null,null,"","",false,{"$f":"INDEX(EWEMs!$E$5:$E$24,MATCH(D482,EWEMs!$W$5:$W$24,0))","v":{"$error":"#N/A"}},"not bath","not kitchen",{"$error":"#VALUE!"},{"$f":"VLOOKUP(Observations!R482,EWEMs!$B$5:$D$24,3,FALSE)","v":{"$error":"#VALUE!"}}]
[null,null,{"$f":"IF(B483=\"\",\"\",INDEX('Units and Spaces'!C:C,MATCH(Observations!B483,'Units and Spaces'!B:B,0)))","v":""},null,null,"",null,null,null,null,null,"","",false,{"$f":"INDEX(EWEMs!$E$5:$E$24,MATCH(D483,EWEMs!$W$5:$W$24,0))","v":{"$error":"#N/A"}},"not bath","not kitchen",{"$error":"#VALUE!"},{"$f":"VLOOKUP(Observations!R483,EWEMs!$B$5:$D$24,3,FALSE)","v":{"$error":"#VALUE!"}}]
[null,null,{"$f":"IF(B484=\"\",\"\",INDEX('Units and Spaces'!C:C,MATCH(Observations!B484,'Units and Spaces'!B:B,0)))","v":""},null,null,"",null,null,null,null,null,"","",false,{"$f":"INDEX(EWEMs!$E$5:$E$24,MATCH(D484,EWEMs!$W$5:$W$24,0))","v":{"$error":"#N/A"}},"not bath","not kitchen",{"$error":"#VALUE!"},{"$f":"VLOOKUP(Observations!R484,EWEMs!$B$5:$D$24,3,FALSE)","v":{"$error":"#VALUE!"}}]
[null,null,{"$f":"IF(B485=\"\",\"\",INDEX('Units and Spaces'!C:C,MATCH(Observations!B485,'Units and Spaces'!B:B,0)))","v":""},null,null,"",null,null,null,null,null,"","",false,{"$f":"INDEX(EWEMs!$E$5:$E$24,MATCH(D485,EWEMs!$W$5:$W$24,0))","v":{"$error":"#N/A"}},"not bath","not kitchen",{"$error":"#VALUE!"},{"$f":"VLOOKUP(Observations!R485,EWEMs!$B$5:$D$24,3,FALSE)","v":{"$error":"#VALUE!"}}]
[null,null,{"$f":"IF(B486=\"\",\"\",INDEX('Units and Spaces'!C:C,MATCH(Observations!B486,'Units and Spaces'!B:B,0)))","v":""},null,null,"",null,null,null,null,null,"","",false,{"$f":"INDEX(EWEMs!$E$5:$E$24,MATCH(D486,EWEMs!$W$5:$W$24,0))","v":{"$error":"#N/A"}},"not bath","not kitchen",{"$error":"#VALUE!"},{"$f":"VLOOKUP(Observations!R486,EWEMs!$B$5:$D$24,3,FALSE)","v":{"$error":"#VALUE!"}}]
[null,null,{"$f":"IF(B487=\"\",\"\",INDEX('Units and Spaces'!C:C,MATCH(Observations!B487,'Units and Spaces'!B:B,0)))","v":""},null,null,"",null,null,null,null,null,{"$f":"IF(OR(F487=\"compliant\",F487=\"noncompliant\"),D487&F487,D487&G487)","v":""},"",false,{"$f":"INDEX(EWEMs!$E$5:$E$24,MATCH(D487,EWEMs!$W$5:$W$24,0))","v":{"$error":"#N/A"}},"not bath","not kitchen",{"$error":"#VALUE!"},{"$f":"VLOOKUP(Observations!R487,EWEMs!$B$5:$D$24,3,FALSE)","v":{"$error":"#VALUE!"}}]
[null,null,{"$f":"IF(B488=\"\",\"\",INDEX('Units and Spaces'!C:C,MATCH(Observations!B488,'Units and Spaces'!B:B,0)))","v":""},null,null,"",null,null,null,null,null,"","",false,{"$f":"INDEX(EWEMs!$E$5:$E$24,MATCH(D488,EWEMs!$W$5:$W$24,0))","v":{"$error":"#N/A"}},"not bath","not kitchen",{"$error":"#VALUE!"},{"$f":"VLOOKUP(Observations!R488,EWEMs!$B$5:$D$24,3,FALSE)","v":{"$error":"#VALUE!"}}]
[null,null,{"$f":"IF(B489=\"\",\"\",INDEX('Units and Spaces'!C:C,MATCH(Observations!B489,'Units and Spaces'!B:B,0)))","v":""},null,null,"",null,null,null,null,null,"","",false,{"$f":"INDEX(EWEMs!$E$5:$E$24,MATCH(D489,EWEMs!$W$5:$W$24,0))","v":{"$error":"#N/A"}},"not bath","not kitchen",{"$error":"#VALUE!"},{"$f":"VLOOKUP(Observations!R489,EWEMs!$B$5:$D$24,3,FALSE)","v":{"$error":"#VALUE!"}}]
[null,null,{"$f":"IF(B490=\"\",\"\",INDEX('Units and Spaces'!C:C,MATCH(Observations!B490,'Units and Spaces'!B:B,0)))","v":""},null,null,"",null,null,null,null,null,"","",false,{"$f":"INDEX(EWEMs!$E$5:$E$24,MATCH(D490,EWEMs!$W$5:$W$24,0))","v":{"$error":"#N/A"}},"not bath","not kitchen",{"$error":"#VALUE!"},{"$f":"VLOOKUP(Observations!R490,EWEMs!$B$5:$D$24,3,FALSE)","v":{"$error":"#VALUE!"}}]
[null,null,{"$f":"IF(B491=\"\",\"\",INDEX('Units and Spaces'!C:C,MATCH(Observations!B491,'Units and Spaces'!B:B,0)))","v":""},null,null,"",null,null,null,null,null,"","",false,{"$f":"INDEX(EWEMs!$E$5:$E$24,MATCH(D491,EWEMs!$W$5:$W$24,0))","v":{"$error":"#N/A"}},"not bath","not kitchen",{"$error":"#VALUE!"},{"$f":"VLOOKUP(Observations!R491,EWEMs!$B$5:$D$24,3,FALSE)","v":{"$error":"#VALUE!"}}]
[null,null,{"$f":"IF(B492=\"\",\"\",INDEX('Units and Spaces'!C:C,MATCH(Observations!B492,'Units and Spaces'!B:B,0)))","v":""},null,null,"",null,null,null,null,null,"","",false,{"$f":"INDEX(EWEMs!$E$5:$E$24,MATCH(D492,EWEMs!$W$5:$W$24,0))","v":{"$error":"#N/A"}},"not bath","not kitchen",{"$error":"#VALUE!"},{"$f":"VLOOKUP(Observations!R492,EWEMs!$B$5:$D$24,3,FALSE)","v":{"$error":"#VALUE!"}}]
[null,null,{"$f":"IF(B493=\"\",\"\",INDEX('Units and Spaces'!C:C,MATCH(Observations!B493,'Units and Spaces'!B:B,0)))","v":""},null,null,"",null,null,null,null,null,"","",false,{"$f":"INDEX(EWEMs!$E$5:$E$24,MATCH(D493,EWEMs!$W$5:$W$24,0))","v":{"$error":"#N/A"}},"not bath","not kitchen",{"$error":"#VALUE!"},{"$f":"VLOOKUP(Observations!R493,EWEMs!$B$5:$D$24,3,FALSE)","v":{"$error":"#VALUE!"}}]
[null,null,{"$f":"IF(B494=\"\",\"\",INDEX('Units and Spaces'!C:C,MATCH(Observations!B494,'Units and Spaces'!B:B,0)))","v":""},null,null,"",null,null,null,null,null,"","",false,{"$f":"INDEX(EWEMs!$E$5:$E$24,MATCH(D494,EWEMs!$W$5:$W$24,0))","v":{"$error":"#N/A"}},"not bath","not kitchen",{"$error":"#VALUE!"},{"$f":"VLOOKUP(Observations!R494,EWEMs!$B$5:$D$24,3,FALSE)","v":{"$error":"#VALUE!"}}]
[null,null,{"$f":"IF(B495=\"\",\"\",INDEX('Units and Spaces'!C:C,MATCH(Observations!B495,'Units and Spaces'!B:B,0)))","v":""},null,null,"",null,null,null,null,null,"","",false,{"$f":"INDEX(EWEMs!$E$5:$E$24,MATCH(D495,EWEMs!$W$5:$W$24,0))","v":{"$error":"#N/A"}},"not bath","not kitchen",{"$error":"#VALUE!"},{"$f":"VLOOKUP(Observations!R495,EWEMs!$B$5:$D$24,3,FALSE)","v":{"$error":"#VALUE!"}}]
[null,null,{"$f":"IF(B496=\"\",\"\",INDEX('Units and Spaces'!C:C,MATCH(Observations!B496,'Units and Spaces'!B:B,0)))","v":""},null,null,"",null,null,null,null,null,"","",false,{"$f":"INDEX(EWEMs!$E$5:$E$24,MATCH(D496,EWEMs!$W$5:$W$24,0))","v":{"$error":"#N/A"}},"not bath","not kitchen",{"$error":"#VALUE!"},{"$f":"VLOOKUP(Observations!R496,EWEMs!$B$5:$D$24,3,FALSE)","v":{"$error":"#VALUE!"}}]
[null,null,{"$f":"IF(B497=\"\",\"\",INDEX('Units and Spaces'!C:C,MATCH(Observations!B497,'Units and Spaces'!B:B,0)))","v":""},null,null,"",null,null,null,null,null,"","",false,{"$f":"INDEX(EWEMs!$E$5:$E$24,MATCH(D497,EWEMs!$W$5:$W$24,0))","v":{"$error":"#N/A"}},"not bath","not kitchen",{"$error":"#VALUE!"},{"$f":"VLOOKUP(Observations!R497,EWEMs!$B$5:$D$24,3,FALSE)","v":{"$error":"#VALUE!"}}]
[null,null,{"$f":"IF(B498=\"\",\"\",INDEX('Units and Spaces'!C:C,MATCH(Observations!B498,'Units and Spaces'!B:B,0)))","v":""},null,null,"",null,null,null,null,null,"","",false,{"$f":"INDEX(EWEMs!$E$5:$E$24,MATCH(D498,EWEMs!$W$5:$W$24,0))","v":{"$error":"#N/A"}},"not bath","not kitchen",{"$error":"#VALUE!"},{"$f":"VLOOKUP(Observations!R498,EWEMs!$B$5:$D$24,3,FALSE)","v":{"$error":"#VALUE!"}}]
[null,null,{"$f":"IF(B499=\"\",\"\",INDEX('Units and Spaces'!C:C,MATCH(Observations!B499,'Units and Spaces'!B:B,0)))","v":""},null,null,"",null,null,null,null,null,"","",false,{"$f":"INDEX(EWEMs!$E$5:$E$24,MATCH(D499,EWEMs!$W$5:$W$24,0))","v":{"$error":"#N/A"}},"not bath","not kitchen",{"$error":"#VALUE!"},{"$f":"VLOOKUP(Observations!R499,EWEMs!$B$5:$D$24,3,FALSE)","v":{"$error":"#VALUE!"}}]
[null,null,{"$f":"IF(B500=\"\",\"\",INDEX('Units and Spaces'!C:C,MATCH(Observations!B500,'Units and Spaces'!B:B,0)))","v":""},null,null,"",null,null,null,null,null,"","",false,{"$f":"INDEX(EWEMs!$E$5:$E$24,MATCH(D500,EWEMs!$W$5:$W$24,0))","v":{"$error":"#N/A"}},"not bath","not kitchen",{"$error":"#VALUE!"},{"$f":"VLOOKUP(Observations!R500,EWEMs!$B$5:$D$24,3,FALSE)","v":{"$error":"#VALUE!"}}]
[null,null,{"$f":"IF(B501=\"\",\"\",INDEX('Units and Spaces'!C:C,MATCH(Observations!B501,'Units and Spaces'!B:B,0)))","v":""},null,null,"",null,null,null,null,null,"","",false,{"$f":"INDEX(EWEMs!$E$5:$E$24,MATCH(D501,EWEMs!$W$5:$W$24,0))","v":{"$error":"#N/A"}},"not bath","not kitchen",{"$error":"#VALUE!"},{"$f":"VLOOKUP(Observations!R501,EWEMs!$B$5:$D$24,3,FALSE)","v":{"$error":"#VALUE!"}}]
[null,null,{"$f":"IF(B502=\"\",\"\",INDEX('Units and Spaces'!C:C,MATCH(Observations!B502,'Units and Spaces'!B:B,0)))","v":""},null,null,"",null,null,null,null,null,"","",false,{"$f":"INDEX(EWEMs!$E$5:$E$24,MATCH(D502,EWEMs!$W$5:$W$24,0))","v":{"$error":"#N/A"}},"not bath","not kitchen",{"$error":"#VALUE!"},{"$f":"VLOOKUP(Observations!R502,EWEMs!$B$5:$D$24,3,FALSE)","v":{"$error":"#VALUE!"}}]
[null,null,{"$f":"IF(B503=\"\",\"\",INDEX('Units and Spaces'!C:C,MATCH(Observations!B503,'Units and Spaces'!B:B,0)))","v":""},null,null,"",null,null,null,null,null,"","",false,{"$f":"INDEX(EWEMs!$E$5:$E$24,MATCH(D503,EWEMs!$W$5:$W$24,0))","v":{"$error":"#N/A"}},"not bath","not kitchen",{"$error":"#VALUE!"},{"$f":"VLOOKUP(Observations!R503,EWEMs!$B$5:$D$24,3,FALSE)","v":{"$error":"#VALUE!"}}]
[null,null,{"$f":"IF(B504=\"\",\"\",INDEX('Units and Spaces'!C:C,MATCH(Observations!B504,'Units and Spaces'!B:B,0)))","v":""},null,null,"",null,null,null,null,null,"","",false,{"$f":"INDEX(EWEMs!$E$5:$E$24,MATCH(D504,EWEMs!$W$5:$W$24,0))","v":{"$error":"#N/A"}},"not bath","not kitchen",{"$error":"#VALUE!"},{"$f":"VLOOKUP(Observations!R504,EWEMs!$B$5:$D$24,3,FALSE)","v":{"$error":"#VALUE!"}}]
[null,null,{"$f":"IF(B505=\"\",\"\",INDEX('Units and Spaces'!C:C,MATCH(Observations!B505,'Units and Spaces'!B:B,0)))","v":""},null,null,"",null,null,null,null,null,"","",false,{"$f":"INDEX(EWEMs!$E$5:$E$24,MATCH(D505,EWEMs!$W$5:$W$24,0))","v":{"$error":"#N/A"}},"not bath","not kitchen",{"$error":"#VALUE!"},{"$f":"VLOOKUP(Observations!R505,EWEMs!$B$5:$D$24,3,FALSE)","v":{"$error":"#VALUE!"}}]
[null,null,{"$f":"IF(B506=\"\",\"\",INDEX('Units and Spaces'!C:C,MATCH(Observations!B506,'Units and Spaces'!B:B,0)))","v":""},null,null,"",null,null,null,null,null,"","",false,{"$f":"INDEX(EWEMs!$E$5:$E$24,MATCH(D506,EWEMs!$W$5:$W$24,0))","v":{"$error":"#N/A"}},"not bath","not kitchen",{"$error":"#VALUE!"},{"$f":"VLOOKUP(Observations!R506,EWEMs!$B$5:$D$24,3,FALSE)","v":{"$error":"#VALUE!"}}]

{"sheet":"Photos","index":5,"n_rows":1,"n_cols":2,"rows_kept":1,"cut":false,"hidden":false,"merged":[]}
["Write the photo location and description here ↓","Insert the photo here, next to the description ↓"]

{"sheet":"Units - Print Sheet","index":6,"n_rows":38,"n_cols":12,"rows_kept":38,"cut":false,"hidden":false,"merged":[[0,11,0,12],[3,8,3,11],[2,8,2,11],[23,7,24,7],[26,7,27,7],[3,6,3,7],[25,1,25,6],[27,1,27,6],[6,1,6,6],[5,1,5,6],[5,7,6,7],[35,7,36,7],[8,7,9,7],[11,7,12,7],[14,7,15,7],[17,7,18,7],[20,7,21,7],[28,1,28,6],[29,7,30,7],[32,7,33,7],[31,1,31,6],[33,1,33,6],[34,1,34,6],[36,1,36,6],[37,1,37,6],[30,1,30,6],[7,1,7,6],[9,1,9,6],[10,1,10,6],[12,1,12,6],[13,1,13,6],[15,1,15,6],[16,1,16,6],[18,1,18,6],[19,1,19,6],[21,1,21,6],[22,1,22,6],[24,1,24,6]]}
[" Green Rewards Verification Inspection",null,null,null,null,null,null,{"$f":"IF(ISBLANK('Property Info'!C20), \"[Enter Inspector's name in Property Info tab]\", 'Property Info'!C20)","v":"[Enter Inspector's name in Property Info tab]"},null,null,{"$f":"IF(ISBLANK('Property Info'!C21), \"[Enter Inspection Company in Property Info tab]\", 'Property Info'!C21)","v":"[Enter Inspection Company in Property Info tab]"},{"$f":"IF(ISBLANK('Property Info'!C22), \"[Enter date of inspection in Property Info tab]\", 'Property Info'!C22)","v":"[Enter date of inspection in Property Info tab]"}]
[null,{"$f":"'Property Info'!E7","v":"Pine Barren Estates"}]
[null,{"$f":"'Property Info'!E8&\", \"&'Property Info'!E9&\", \"&'Property Info'!E11","v":"349 Marlboro Drive, Stockton, 92587"},null,null,null,null,null,null,"Inspection number ___________"]
[null,null,null,null,null,null,"Unit Number",null,{"$f":"\"out of \"&'Property Info'!G23&\" total required units to inspect.\"","v":"out of 10 total required units to inspect."}]
[null,"In Unit EWEMs required for inspection:"]
[1,{"$f":"IFERROR(INDEX(selectedEWEMs,SMALL(IF(IF(ISNUMBER(SEARCH(\"Apartments\",ApartmentList)),TRUE,FALSE),ROW(ApartmentList)-MIN(ROW(ApartmentList))+1),EWEMs!A5)),\"\")","v":"Upgrade in-unit lighting"},null,null,null,null,null,"Compliant? Y/N","Visual description & notes"]
[null,{"$f":"IFERROR(INDEX(EWEMs!D5:D24,SMALL(IF(IF(ISNUMBER(SEARCH(\"Apartments\",ApartmentList)),TRUE,FALSE),ROW(ApartmentList)-MIN(ROW(ApartmentList))+1),EWEMs!A5)),\"\")","v":"Lighting - Interior - High Efficiency (LED), All Res. Units"}]
[null,{"$f":"IFERROR(\"BEFORE: \"&VLOOKUP(B6,Data!A:C,3,FALSE)&\" DURING: \"&VLOOKUP(B6,Data!A:D,4,FALSE),\"\")","v":"BEFORE: Request the installed product specifications and determine sample size required for verification of each fixture type to be inspected during site visit; refer to Inspection Form or invoices for full fixture quantities by type and location. Take note of where in the unit these are installed (e.g. highlight on printout of unit layout) for easier access during the site visit. DURING: Verify lighting fixtures according to determined sample size, confirming they are installed, operational and match the product specifications. "},null,null,null,null,null,"Nameplate GPM/GPF (if applicable)"]
[2,{"$f":"IFERROR(INDEX(selectedEWEMs,SMALL(IF(IF(ISNUMBER(SEARCH(\"Apartments\",ApartmentList)),TRUE,FALSE),ROW(ApartmentList)-MIN(ROW(ApartmentList))+1),EWEMs!A6)),\"\")","v":"Upgrade exterior lighting"},null,null,null,null,null,"Compliant? Y/N","Visual description & notes"]
[null,{"$f":"IFERROR(INDEX(EWEMs!$D$5:$D$24,SMALL(IF(IF(ISNUMBER(SEARCH(\"Apartments\",ApartmentList)),TRUE,FALSE),ROW(ApartmentList)-MIN(ROW(ApartmentList))+1),EWEMs!A6)),\"\")","v":"Lighting - Exterior - High Efficiency (LED), All Res. Units"}]
[null,{"$f":"IFERROR(\"BEFORE: \"&VLOOKUP(B9,Data!A:C,3,FALSE)&\" DURING: \"&VLOOKUP(B9,Data!A:D,4,FALSE),\"\")","v":"BEFORE: Request the installed product specifications and determine sample size required for verification of each fixture type to be inspected during site visit; refer to Inspection Form or invoices for full fixture quantities by type and location. Take note of where on the property these are installed (e.g. highlight on printout of property map) for easier access during the site visit. DURING: Verify lighting fixtures according to determined sample size, confirming they are installed, operational and match the product specifications. "},null,null,null,null,null,"Nameplate GPM/GPF (if applicable)"]
[3,{"$f":"IFERROR(INDEX(selectedEWEMs,SMALL(IF(IF(ISNUMBER(SEARCH(\"Apartments\",ApartmentList)),TRUE,FALSE),ROW(ApartmentList)-MIN(ROW(ApartmentList))+1),EWEMs!A7)),\"\")","v":"Install low-flow kitchen faucets"},null,null,null,null,null,"Compliant? Y/N","Visual description & notes"]
[null,{"$f":"IFERROR(INDEX(EWEMs!$D$5:$D$24,SMALL(IF(IF(ISNUMBER(SEARCH(\"Apartments\",ApartmentList)),TRUE,FALSE),ROW(ApartmentList)-MIN(ROW(ApartmentList))+1),EWEMs!A7)),\"\")","v":"Water Fixture - Kitchen Aerators (1.0 gpm), All Res. Units"}]
[null,{"$f":"IFERROR(\"BEFORE: \"&VLOOKUP(B12,Data!A:C,3,FALSE)&\" DURING: \"&VLOOKUP(B12,Data!A:D,4,FALSE),\"\")","v":"BEFORE: Request invoice and product specification sheets for low flow fixtures from property manager; input cost value, amount of aerators, and nameplate ratings in gallons per minute (GPM).  Determine necessary sample size based on number of installed units. DURING: Visit overstock room; i.e. supply closet or maintenance office. Take photos of nameplate information on aerator boxes if available. Record apartment number. Take photo of fixture aerator with close up of nameplate rating, typically engraved on its casing. Verify that it is operational and matches the rating in the specification sheets."},null,null,null,null,null,"Nameplate GPM/GPF (if applicable)"]
[4,{"$f":"IFERROR(INDEX(selectedEWEMs,SMALL(IF(IF(ISNUMBER(SEARCH(\"Apartments\",ApartmentList)),TRUE,FALSE),ROW(ApartmentList)-MIN(ROW(ApartmentList))+1),EWEMs!A8)),\"\")","v":"Install low-flow bath faucets"},null,null,null,null,null,"Compliant? Y/N","Visual description & notes"]
[null,{"$f":"IFERROR(INDEX(EWEMs!$D$5:$D$24,SMALL(IF(IF(ISNUMBER(SEARCH(\"Apartments\",ApartmentList)),TRUE,FALSE),ROW(ApartmentList)-MIN(ROW(ApartmentList))+1),EWEMs!A8)),\"\")","v":"Water Fixture - Bathroom Aerators (0.5 gpm), All Res. Units"}]
[null,{"$f":"IFERROR(\"BEFORE: \"&VLOOKUP(B15,Data!A:C,3,FALSE)&\" DURING: \"&VLOOKUP(B15,Data!A:D,4,FALSE),\"\")","v":"BEFORE: Request invoice and product specification sheets for low flow fixtures from property manager; input cost value, amount of aerators, and nameplate ratings in gallons per minute (GPM).  Determine necessary sample size based on number of installed units. IF SPEC IS 0.5 GPM: a 1.0 GPM fixture will be considered compliant.  DURING: Visit overstock room; i.e. supply closet or maintenance office. Take photos of nameplate information on aerator boxes if available. Record apartment number. Take photo of fixture aerator with close up of nameplate rating, typically engraved on its casing. Verify that it is operational and matches the rating in the specification sheets."},null,null,null,null,null,"Nameplate GPM/GPF (if applicable)"]
[5,{"$f":"IFERROR(INDEX(selectedEWEMs,SMALL(IF(IF(ISNUMBER(SEARCH(\"Apartments\",ApartmentList)),TRUE,FALSE),ROW(ApartmentList)-MIN(ROW(ApartmentList))+1),EWEMs!A9)),\"\")","v":""},null,null,null,null,null,"Compliant? Y/N","Visual description & notes"]
[null,{"$f":"IFERROR(INDEX(EWEMs!$D$5:$D$24,SMALL(IF(IF(ISNUMBER(SEARCH(\"Apartments\",ApartmentList)),TRUE,FALSE),ROW(ApartmentList)-MIN(ROW(ApartmentList))+1),EWEMs!A9)),\"\")","v":""}]
[null,{"$f":"IFERROR(\"BEFORE: \"&VLOOKUP(B18,Data!A:C,3,FALSE)&\" DURING: \"&VLOOKUP(B18,Data!A:D,4,FALSE),\"\")","v":""},null,null,null,null,null,"Nameplate GPM/GPF (if applicable)"]
[6,{"$f":"IFERROR(INDEX(selectedEWEMs,SMALL(IF(IF(ISNUMBER(SEARCH(\"Apartments\",ApartmentList)),TRUE,FALSE),ROW(ApartmentList)-MIN(ROW(ApartmentList))+1),EWEMs!A10)),\"\")","v":""},null,null,null,null,null,"Compliant? Y/N","Visual description & notes"]
[null,{"$f":"IFERROR(INDEX(EWEMs!$D$5:$D$24,SMALL(IF(IF(ISNUMBER(SEARCH(\"Apartments\",ApartmentList)),TRUE,FALSE),ROW(ApartmentList)-MIN(ROW(ApartmentList))+1),EWEMs!A10)),\"\")","v":""}]
[null,{"$f":"IFERROR(\"BEFORE: \"&VLOOKUP(B21,Data!A:C,3,FALSE)&\" DURING: \"&VLOOKUP(B21,Data!A:D,4,FALSE),\"\")","v":""},null,null,null,null,null,"Nameplate GPM/GPF (if applicable)"]
[7,{"$f":"IFERROR(INDEX(selectedEWEMs,SMALL(IF(IF(ISNUMBER(SEARCH(\"Apartments\",ApartmentList)),TRUE,FALSE),ROW(ApartmentList)-MIN(ROW(ApartmentList))+1),EWEMs!A11)),\"\")","v":""},null,null,null,null,null,"Compliant? Y/N","Visual description & notes"]
[null,{"$f":"IFERROR(INDEX(EWEMs!$D$5:$D$24,SMALL(IF(IF(ISNUMBER(SEARCH(\"Apartments\",ApartmentList)),TRUE,FALSE),ROW(ApartmentList)-MIN(ROW(ApartmentList))+1),EWEMs!A11)),\"\")","v":""}]
[null,{"$f":"IFERROR(\"BEFORE: \"&VLOOKUP(B24,Data!A:C,3,FALSE)&\" DURING: \"&VLOOKUP(B24,Data!A:D,4,FALSE),\"\")","v":""},null,null,null,null,null,"Nameplate GPM/GPF (if applicable)"]
[8,{"$f":"IFERROR(INDEX(selectedEWEMs,SMALL(IF(IF(ISNUMBER(SEARCH(\"Apartments\",ApartmentList)),TRUE,FALSE),ROW(ApartmentList)-MIN(ROW(ApartmentList))+1),EWEMs!A12)),\"\")","v":""},null,null,null,null,null,"Compliant? Y/N","Visual description & notes"]
[null,{"$f":"IFERROR(INDEX(EWEMs!$D$5:$D$24,SMALL(IF(IF(ISNUMBER(SEARCH(\"Apartments\",ApartmentList)),TRUE,FALSE),ROW(ApartmentList)-MIN(ROW(ApartmentList))+1),EWEMs!A12)),\"\")","v":""}]
[null,{"$f":"IFERROR(\"BEFORE: \"&VLOOKUP(B27,Data!A:C,3,FALSE)&\" DURING: \"&VLOOKUP(B27,Data!A:D,4,FALSE),\"\")","v":""},null,null,null,null,null,"Nameplate GPM/GPF (if applicable)"]
[9,{"$f":"IFERROR(INDEX(selectedEWEMs,SMALL(IF(IF(ISNUMBER(SEARCH(\"Apartments\",ApartmentList)),TRUE,FALSE),ROW(ApartmentList)-MIN(ROW(ApartmentList))+1),EWEMs!A13)),\"\")","v":""},null,null,null,null,null,"Compliant? Y/N","Visual description & notes"]
[null,{"$f":"IFERROR(INDEX(EWEMs!$D$5:$D$24,SMALL(IF(IF(ISNUMBER(SEARCH(\"Apartments\",ApartmentList)),TRUE,FALSE),ROW(ApartmentList)-MIN(ROW(ApartmentList))+1),EWEMs!A13)),\"\")","v":""}]
[null,{"$f":"IFERROR(\"BEFORE: \"&VLOOKUP(B30,Data!A:C,3,FALSE)&\" DURING: \"&VLOOKUP(B30,Data!A:D,4,FALSE),\"\")","v":""},null,null,null,null,null,"Nameplate GPM/GPF (if applicable)"]
[10,{"$f":"IFERROR(INDEX(selectedEWEMs,SMALL(IF(IF(ISNUMBER(SEARCH(\"Apartments\",ApartmentList)),TRUE,FALSE),ROW(ApartmentList)-MIN(ROW(ApartmentList))+1),EWEMs!A14)),\"\")","v":""},null,null,null,null,null,"Compliant? Y/N","Visual description & notes"]
[null,{"$f":"IFERROR(INDEX(EWEMs!$D$5:$D$24,SMALL(IF(IF(ISNUMBER(SEARCH(\"Apartments\",ApartmentList)),TRUE,FALSE),ROW(ApartmentList)-MIN(ROW(ApartmentList))+1),EWEMs!A14)),\"\")","v":""}]
[null,{"$f":"IFERROR(\"BEFORE: \"&VLOOKUP(B33,Data!A:C,3,FALSE)&\" DURING: \"&VLOOKUP(B33,Data!A:D,4,FALSE),\"\")","v":""},null,null,null,null,null,"Nameplate GPM/GPF (if applicable)"]
[11,{"$f":"IFERROR(INDEX(selectedEWEMs,SMALL(IF(IF(ISNUMBER(SEARCH(\"Apartments\",ApartmentList)),TRUE,FALSE),ROW(ApartmentList)-MIN(ROW(ApartmentList))+1),EWEMs!A15)),\"\")","v":""},null,null,null,null,null,"Compliant? Y/N","Visual description & notes"]
[null,{"$f":"IFERROR(INDEX(EWEMs!$D$5:$D$24,SMALL(IF(IF(ISNUMBER(SEARCH(\"Apartments\",ApartmentList)),TRUE,FALSE),ROW(ApartmentList)-MIN(ROW(ApartmentList))+1),EWEMs!A15)),\"\")","v":""}]
[null,{"$f":"IFERROR(\"BEFORE: \"&VLOOKUP(B36,Data!A:C,3,FALSE)&\" DURING: \"&VLOOKUP(B36,Data!A:D,4,FALSE),\"\")","v":""},null,null,null,null,null,"Nameplate GPM/GPF (if applicable)"]

{"sheet":"CommonArea - Print Sheet","index":7,"n_rows":29,"n_cols":12,"rows_kept":29,"cut":false,"hidden":false,"merged":[[28,1,28,6],[22,1,22,6],[23,7,24,7],[24,1,24,6],[25,1,25,6],[26,7,27,7],[27,1,27,6],[17,7,18,7],[18,1,18,6],[19,1,19,6],[20,7,21,7],[21,1,21,6],[13,1,13,6],[14,7,15,7],[15,1,15,6],[16,1,16,6],[7,1,7,6],[8,7,9,7],[9,1,9,6],[10,1,10,6],[11,7,12,7],[12,1,12,6],[0,11,0,12],[2,8,2,11],[3,6,3,7],[3,8,3,11],[5,7,6,7],[6,1,6,6]]}
[" Green Rewards Verification Inspection",null,null,null,null,null,null,{"$f":"IF(ISBLANK('Property Info'!C20), \"[Enter Inspector's name in Property Info tab]\", 'Property Info'!C20)","v":"[Enter Inspector's name in Property Info tab]"},null,null,{"$f":"IF(ISBLANK('Property Info'!C21), \"[Enter Inspection Company in Property Info tab]\", 'Property Info'!C21)","v":"[Enter Inspection Company in Property Info tab]"},{"$f":"IF(ISBLANK('Property Info'!C22), \"[Enter date of inspection in Property Info tab]\", 'Property Info'!C22)","v":"[Enter date of inspection in Property Info tab]"}]
[null,{"$f":"'Property Info'!E7","v":"Pine Barren Estates"}]
[null,{"$f":"'Property Info'!E8&\", \"&'Property Info'!E9&\", \"&'Property Info'!E11","v":"349 Marlboro Drive, Stockton, 92587"}]
[null,null,null,null,null,null,"Common Area Name(s)"]
[null,"Common Area EWEMs required for inspection:"]
[1,{"$f":"IFERROR(\nINDEX(selectedEWEMs,SMALL(\nIF(IF(ISNUMBER(SEARCH(\"Common\",ApartmentList)),TRUE,FALSE),ROW(ApartmentList)-MIN(ROW(ApartmentList))+1),EWEMs!A5)\n),\"\")","v":"Upgrade common area lighting"},null,null,null,null,null,"Compliant? Y/N","Visual description, locations & notes"]
[null,{"$f":"IFERROR(INDEX(EWEMs!$D$5:$D$24,SMALL(IF(IF(ISNUMBER(SEARCH(\"Common\",ApartmentList)),TRUE,FALSE),ROW(ApartmentList)-MIN(ROW(ApartmentList))+1),EWEMs!A5)),\"\")","v":"Lighting - Interior - High Efficiency (LED), Common Area"}]
[null,{"$f":"IFERROR(VLOOKUP(B6,Data!A:C,3,FALSE),\"\")","v":"Request the installed product specifications and determine sample size required for verification of each fixture type to be inspected during site visit; refer to Inspection Form or invoices for full fixture quantities by type and location. Take note of where on the property these are installed (e.g. highlight on printout of property map) for easier access during the site visit."},null,null,null,null,null,"Nameplate GPM/GPF (if applicable)"]
[2,{"$f":"IFERROR(\nINDEX(selectedEWEMs,SMALL(\nIF(IF(ISNUMBER(SEARCH(\"Common\",ApartmentList)),TRUE,FALSE),ROW(ApartmentList)-MIN(ROW(ApartmentList))+1),EWEMs!A6)\n),\"\")","v":"Upgrade exterior lighting"},null,null,null,null,null,"Compliant? Y/N","Visual description, locations & notes"]
[null,{"$f":"IFERROR(INDEX(EWEMs!$D$5:$D$24,SMALL(IF(IF(ISNUMBER(SEARCH(\"Common\",ApartmentList)),TRUE,FALSE),ROW(ApartmentList)-MIN(ROW(ApartmentList))+1),EWEMs!A6)),\"\")","v":"Lighting - Exterior - High Efficiency (LED), Common Area"}]
[null,{"$f":"IFERROR(VLOOKUP(B9,Data!A:C,3,FALSE),\"\")","v":"Request the installed product specifications and determine sample size required for verification of each fixture type to be inspected during site visit; refer to Inspection Form or invoices for full fixture quantities by type and location. Take note of where on the property these are installed (e.g. highlight on printout of property map) for easier access during the site visit."},null,null,null,null,null,"Nameplate GPM/GPF (if applicable)"]
[3,{"$f":"IFERROR(\nINDEX(selectedEWEMs,SMALL(\nIF(IF(ISNUMBER(SEARCH(\"Common\",ApartmentList)),TRUE,FALSE),ROW(ApartmentList)-MIN(ROW(ApartmentList))+1),EWEMs!A7)\n),\"\")","v":""},null,null,null,null,null,"Compliant? Y/N","Visual description, locations & notes"]
[null,{"$f":"IFERROR(INDEX(EWEMs!$D$5:$D$24,SMALL(IF(IF(ISNUMBER(SEARCH(\"Common\",ApartmentList)),TRUE,FALSE),ROW(ApartmentList)-MIN(ROW(ApartmentList))+1),EWEMs!A7)),\"\")","v":""}]
[null,{"$f":"IFERROR(VLOOKUP(B12,Data!A:C,3,FALSE),\"\")","v":""},null,null,null,null,null,"Nameplate GPM/GPF (if applicable)"]
[4,{"$f":"IFERROR(\nINDEX(selectedEWEMs,SMALL(\nIF(IF(ISNUMBER(SEARCH(\"Common\",ApartmentList)),TRUE,FALSE),ROW(ApartmentList)-MIN(ROW(ApartmentList))+1),EWEMs!A8)\n),\"\")","v":""},null,null,null,null,null,"Compliant? Y/N","Visual description, locations & notes"]
[null,{"$f":"IFERROR(INDEX(EWEMs!$D$5:$D$24,SMALL(IF(IF(ISNUMBER(SEARCH(\"Common\",ApartmentList)),TRUE,FALSE),ROW(ApartmentList)-MIN(ROW(ApartmentList))+1),EWEMs!A8)),\"\")","v":""}]
[null,{"$f":"IFERROR(VLOOKUP(B15,Data!A:C,3,FALSE),\"\")","v":""},null,null,null,null,null,"Nameplate GPM/GPF (if applicable)"]
[5,{"$f":"IFERROR(\nINDEX(selectedEWEMs,SMALL(\nIF(IF(ISNUMBER(SEARCH(\"Common\",ApartmentList)),TRUE,FALSE),ROW(ApartmentList)-MIN(ROW(ApartmentList))+1),EWEMs!A9)\n),\"\")","v":""},null,null,null,null,null,"Compliant? Y/N","Visual description, locations & notes"]
[null,{"$f":"IFERROR(INDEX(EWEMs!$D$5:$D$24,SMALL(IF(IF(ISNUMBER(SEARCH(\"Common\",ApartmentList)),TRUE,FALSE),ROW(ApartmentList)-MIN(ROW(ApartmentList))+1),EWEMs!A9)),\"\")","v":""}]
[null,{"$f":"IFERROR(VLOOKUP(B18,Data!A:C,3,FALSE),\"\")","v":""},null,null,null,null,null,"Nameplate GPM/GPF (if applicable)"]
[6,{"$f":"IFERROR(\nINDEX(selectedEWEMs,SMALL(\nIF(IF(ISNUMBER(SEARCH(\"Common\",ApartmentList)),TRUE,FALSE),ROW(ApartmentList)-MIN(ROW(ApartmentList))+1),EWEMs!A10)\n),\"\")","v":""},null,null,null,null,null,"Compliant? Y/N","Visual description, locations & notes"]
[null,{"$f":"IFERROR(INDEX(EWEMs!$D$5:$D$24,SMALL(IF(IF(ISNUMBER(SEARCH(\"Common\",ApartmentList)),TRUE,FALSE),ROW(ApartmentList)-MIN(ROW(ApartmentList))+1),EWEMs!A10)),\"\")","v":""}]
[null,{"$f":"IFERROR(VLOOKUP(B21,Data!A:C,3,FALSE),\"\")","v":""},null,null,null,null,null,"Nameplate GPM/GPF (if applicable)"]
[7,{"$f":"IFERROR(INDEX(selectedEWEMs,SMALL(IF(ApartmentList=\"Common Areas\",ROW(ApartmentList)-MIN(ROW(ApartmentList))+1),EWEMs!A11)),\"\")","v":""},null,null,null,null,null,"Compliant? Y/N","Visual description, locations & notes"]
[null,{"$f":"IFERROR(INDEX(EWEMs!$D$5:$D$24,SMALL(IF(ApartmentList=\"Common Areas\",ROW(ApartmentList)-MIN(ROW(ApartmentList))+1),EWEMs!A11)),\"\")","v":""}]
[null,{"$f":"IFERROR(VLOOKUP(B24,Data!A:C,3,FALSE),\"\")","v":""},null,null,null,null,null,"Nameplate GPM/GPF (if applicable)"]
[8,{"$f":"IFERROR(INDEX(selectedEWEMs,SMALL(IF(ApartmentList=\"Common Areas\",ROW(ApartmentList)-MIN(ROW(ApartmentList))+1),EWEMs!A11)),\"\")","v":""},null,null,null,null,null,"Compliant? Y/N","Visual description, locations & notes"]
[null,{"$f":"IFERROR(INDEX(EWEMs!$D$5:$D$24,SMALL(IF(ApartmentList=\"Common Areas\",ROW(ApartmentList)-MIN(ROW(ApartmentList))+1),EWEMs!A11)),\"\")","v":""}]
[null,{"$f":"IFERROR(VLOOKUP(B27,Data!A:C,3,FALSE),\"\")","v":""},null,null,null,null,null,"Nameplate GPM/GPF (if applicable)"]

{"sheet":"Data","index":8,"n_rows":94,"n_cols":9,"rows_kept":94,"cut":false,"hidden":true,"merged":[]}
[]
[]
[]
[]
[]
["EWEM",null,"Before Inspection","During Inspection"]
["Add or upgrade BAS/EMS/EMCS","complex","Request the installed product specifications and user manual if applicable; refer to Inspection Form or invoices. Take note of where the system is installed (i.e. highlight on printout of property map) for easier access during the site visit.","Take photos of controls including nameplate, verifying that this matches with specification. If needing to cycle through control settings, consult property staff and refer to user manual prior to doing so as this can impact default or custom conditions.","compliant",null,null,null,{"$f":"UPPER(B7)","v":"COMPLEX"}]
["Add or upgrade controls","complex","Request the installed product specifications and user manual if applicable; refer to Inspection Form or invoices. Take note of where the system is installed (i.e. highlight on printout of property map) for easier access during the site visit.","Take photos of controls including nameplate, verifying that this matches with specification. If needing to cycle through control settings, consult property staff and refer to user manual prior to doing so as this can impact default or custom conditions.","noncompliant",null,null,null,{"$f":"UPPER(B8)","v":"COMPLEX"}]
["Convert pneumatic controls to DDC","complex","Request the installed product specifications and user manual if applicable; refer to Inspection Form or invoices. Take note of where the system is installed (i.e. highlight on printout of property map) for easier access during the site visit.","Take photos of controls including nameplate, verifying that this matches with specification. If needing to cycle through control settings, consult property staff and refer to user manual prior to doing so as this can impact default or custom conditions.",null,null,null,null,"COMPLEX"]
["Install advanced metering systems","complex","Review the specification in the HPB and Inspection Form. Document any digital infrastructure with property staff with screenshots or login information; e.g. meter data management system.","Take photo confirming the correct equipment was installed based on product specifications; e.g. advanced/smart meters and/or load control devices in utility closets or exterior of building.",null,null,null,null,"COMPLEX"]
["Other","basic","Review the specification in the HPB and Inspection Form.","Take photos of nameplate to confirm model matches with product specifications. Verification of operability contingent on type of upgrade.","Apartment",null,null,null,"BASIC"]
["Replace dishwashers with ENERGY STAR rated","basic","Look at the appliance for the product tag and labeling. Look for an ENERGY STAR designation. Look up the product model number online to confirm if ENERGY STAR.","Confirm that the system is operational and working properly. Take photos of nameplate found within the appliance to confirm it matches the product specifications. ","Common Area",null,null,null,"BASIC"]
["Replace clothes dryers with ENERGY STAR rated","basic","Look at the appliance for the product tag and labeling. Look for an ENERGY STAR designation. Look up the product model number online to confirm if ENERGY STAR.","Confirm that the system is operational and working properly. Take photos of nameplate found within the appliance to confirm it matches the product specifications. ",null,null,null,null,"BASIC"]
["Replace washing machines ENERGY STAR rated","basic","Look at the appliance for the product tag and labeling. Look for an ENERGY STAR designation. Look up the product model number online to confirm if ENERGY STAR.","Confirm that the system is operational and working properly. Take photos of nameplate found within the appliance to confirm it matches the product specifications. ",null,null,null,null,"BASIC"]
["Replace refrigerators with ENERGY STAR rated","basic","Look at the appliance for the product tag and labeling. Look for an ENERGY STAR designation. Look up the product model number online to confirm if ENERGY STAR.","Confirm that the system is operational and working properly. Take photos of nameplate found within the appliance to confirm it matches the product specifications. ",null,null,null,null,"BASIC"]
["Install plug load controls","basic","Request the installed product specifications and user manual if applicable; refer to Inspection Form or invoices.","Take photos of controls including nameplate, verifying that this matches with specification. If needing to cycle through control settings, consult property staff and refer to user manual prior to doing so as this can impact default or custom conditions.",null,null,null,null,"BASIC"]
["Install programmable thermostats","basic","Request the installed product specifications and user manual if applicable; refer to Inspection Form or invoices.","Take photos of controls including nameplate, verifying that this matches with specification. If needing to cycle through thermostat settings, consult property staff and refer to user manual prior to doing so as this can impact default or custom conditions.",null,null,null,null,"BASIC"]
["Install smart thermostats","basic","Request the installed product specifications and user manual if applicable; refer to Inspection Form or invoices.","Take photos of controls including nameplate, verifying that this matches with specification. If needing to cycle through thermostat settings, consult property staff and refer to user manual prior to doing so as this can impact default or custom conditions. If property has wireless internet, then MUST be connected to internet for compliance. If it is tenant-wifi only, then connection to internet is optional for compliance. ",null,null,null,null,"BASIC"]
["Install or replace heat pumps","basic","Request the installed product specifications and determine sample size required for verification of each model type to be inspected during site visit; refer to Inspection Form or invoices for quantities by type and location. Take note of where on the property these are installed (i.e. highlight on printout of property map) for easier access during the site visit; e.g. patio or rooftop.","Verify models installed match the product specifications and are operational; i.e.ensure that fan on indoor air handler is blowing, and the air is hot or cool based on thermostat setpoint temperature, by feeling the air as it exits the ducts. For water based heat pump systems, where ducts may not be present, use an infrared thermometer or simply touch the radiator, domestic hot water outlet, or radiant floor depending on application to confirm that the system is functioning as intended according to thermostat setpoints.",null,null,null,null,"BASIC"]
["Replace split system AC","basic","Request the installed product specifications and determine sample size required for verification of each model type to be inspected during site visit; refer to Inspection Form or invoices for quantities by type and location. Take note of where on the property these are installed (i.e. highlight on printout of property map) for easier access during the site visit; e.g. patio or rooftop.","Verify models installed match the product specifications and are operational; i.e.ensure that fan on indoor air handler is blowing, and the air cool based on thermostat setpoint temperature, by feeling the air as it exits the ducts.Check that the condenser fan, outside of the apartment, is functioning and heat is being expelled by the unit.",null,null,null,null,"BASIC"]
["Replace split system AC with furnace","basic","Request the installed product specifications and determine sample size required for verification of each model type to be inspected during site visit; refer to Inspection Form or invoices for quantities by type and location. Take note of where in the apartments these are installed (i.e. highlight on printout of unit layout) for easier access during the site visit; e.g. utility closet.","Verify models installed match the product specifications and are operational; i.e.ensure that fan on indoor air handler is blowing, and the air is hot based on thermostat setpoint temperature, by feeling the air as it exits the ducts.",null,null,null,null,"BASIC"]
["Replace furnace","basic","Request the installed product specifications and determine sample size required for verification of each model type to be inspected during site visit; refer to Inspection Form or invoices for quantities by type and location. Take note of where in the apartments these are installed (i.e. highlight on printout of unit layout) for easier access during the site visit; e.g. utility closet.","Verify models installed match the product specifications and are operational; i.e.ensure that fan on indoor air handler is blowing, and the air is hot based on thermostat setpoint temperature, by feeling the air as it exits the ducts.",null,null,null,null,"BASIC"]
["Replace package units","basic","Request the installed product specifications and determine sample size required for verification of each model type to be inspected during site visit; refer to Inspection Form or invoices for quantities by type and location. Take note of where on the property these are installed (i.e. highlight on printout of property map) for easier access during the site visit; e.g. rooftop.","Verify models installed match the product specifications and are operational; i.e.ensure that the duct air in the apartment is cool, based on thermostat setpoint temperature, by feeling the air as it exits the ducts. Check that the packaged unit, outside of the apartment, is functioning and heat is being expelled by the unit.",null,null,null,null,"BASIC"]
["Replace or modify AHU","complex","Request the installed product specifications and determine sample size required for verification of each model type to be inspected during site visit; refer to Inspection Form or invoices for quantities by type and location. Take note of where on the property these are installed (e.g. highlight on printout of property map) for easier access during the site visit; e.g. rooftop or basement.","Verify models installed match the product specifications and are operational; i.e.ensure that the duct air in the apartment is hot and/or cool, based on thermostat setpoint temperature and model features, by feeling the air as it exits the ducts. Check that air intake and exhaust on AHU are functioning properly.",null,null,null,null,"COMPLEX"]
["Replace PTACs","basic","Request the installed product specifications and determine sample size required for verification of each model type to be inspected during site visit; refer to Inspection Form or invoices for quantities by type and location. Take note of where in the apartments these are installed (i.e. highlight on printout of unit layout) for easier access during the site visit.","Verify models installed match the product specifications and are operational; i.e.ensure that fan on PTAC unit is blowing, and the air is hot or cool based on PTAC setpoint temperature, by feeling the air as it exits the unit.",null,null,null,null,"BASIC"]
["Replace wall/window AC","basic","Request the installed product specifications and determine sample size required for verification of each model type to be inspected during site visit; refer to Inspection Form or invoices for quantities by type and location. Take note of where in the apartments these are installed (i.e. highlight on printout of unit layout) for easier access during the site visit.","Verify models installed match the product specifications and are operational; i.e.ensure that fan on AC unit is blowing, and the air is hot or cool based on AC setpoint temperature, by feeling the air as it exits the unit.",null,null,null,null,"BASIC"]
["Add duct insulation","basic","Request the installed product specifications and determine sample size required for verification to be inspected during site visit; refer to Inspection Form or invoices.","Access the attic space and/or HVAC access panel within apartments to confirm that insulation is installed. Measure thickness of insulation wrapped around ducts to confirm it matches the product specifications.",null,null,null,null,"BASIC"]
["Seal ducts","basic","Request the installed product specifications and determine sample size required for verification to be inspected during site visit; refer to Inspection Form or invoices.","Access the attic space and/or HVAC access panel within apartments to confirm that duct sealant is installed; for internal duct sealant, check for foam rubber or sealant by carefully removing grilles on supply and return registers. For external duct sealant, check for tape or mastic around duct exterior. Take photos veriyfing that this matches product specifications.",null,null,null,null,"BASIC"]
["Replace exhaust or ventilation fans","basic","Request the installed product specifications and determine sample size required for verification of each model type to be inspected during site visit; refer to Inspection Form or invoices for quantities by type and location. Take note of where in the apartments these are installed (i.e. highlight on printout of unit layout) for easier access during the site visit; e.g. bathroom ceiling.","Verify models installed match the product specifications and are operational; i.e.ensure that fan on ventilation unit is blowing when wall switch or unit dial is switched on.",null,null,null,null,"BASIC"]
["Upgrade and balance ventilation system","complex","Request the installed product specifications and determine type of upgrades performed on ventilation system; refer to Inspection Form or invoices.","Access the attic space to confirm upgrades accounting for separation in ventilation and air handling systems. Take photos veriyfing that this matches product specifications and, if part of the upgrade, document both ductwork as well as  supply and exhaust fans.",null,null,null,null,"COMPLEX"]
["Install ground source heat pump system","complex","Request the installed product specifications and determine sample size required for verification of each model type to be inspected during site visit; refer to Inspection Form or invoices for quantities by type and location. Take note of where on the property these are installed (i.e. highlight on printout of property map) for easier access during the site visit; e.g. patio or rooftop.","Verify models installed match the product specifications and are operational; i.e.ensure that fan on indoor air handler is blowing, and the air is hot or cool based on thermostat setpoint temperature, by feeling the air as it exits the ducts. For water based heat pump systems, where ducts may not be present, use an infrared thermometer or simply touch the radiator, domestic hot water outlet, or radiant floor depending on application to confirm that the system is functioning as intended according to thermostat setpoints.",null,null,null,null,"COMPLEX"]
["Add or replace cooling tower","complex","Request the installed product specifications and determine sample size required for verification of each model type to be inspected during site visit; refer to Inspection Form or invoices for quantities by type and location. Take note of where on the property these are installed (i.e. highlight on printout of property map) for easier access during the site visit; e.g. rooftop.","Take photos of nameplate to confirm models installed match the product specifications and visually confirm these are operational; i.e. cooling tower fan is on and exhaust is released from air outlet.",null,null,null,null,"COMPLEX"]
["Add economizer","complex","Request the installed product specifications and determine sample size required for verification of each model type to be inspected during site visit; refer to Inspection Form or invoices for quantities by type and location. Take note of where on the property these are installed (i.e. highlight on printout of property map) for easier access during the site visit; e.g. rooftop.","Take photos of nameplate and temperature sensor, if accesible, to confirm models installed match the product specifications and visually confirm the unit is operational.",null,null,null,null,"COMPLEX"]
["Add energy recovery","complex","Review the specification in the HPB and Inspection Form.","Take photos of nameplate to confirm model matches with product specifications. Verification of operability contingent on type of upgrade.",null,null,null,null,"COMPLEX"]
["Other heating","basic","Review the specification in the HPB and Inspection Form.","Take photos of nameplate to confirm model matches with product specifications. Verification of operability contingent on type of upgrade.",null,null,null,null,"BASIC"]
["Other cooling","basic","Review the specification in the HPB and Inspection Form.","Take photos of nameplate to confirm model matches with product specifications. Verification of operability contingent on type of upgrade.",null,null,null,null,"BASIC"]
["Other ventilation","complex","Review the specification in the HPB and Inspection Form.","Take photos of nameplate to confirm model matches with product specifications. Verification of operability contingent on type of upgrade.",null,null,null,null,"COMPLEX"]
["Other distribution","complex","Review the specification in the HPB and Inspection Form.","Take photos of nameplate to confirm model matches with product specifications. Verification of operability contingent on type of upgrade.",null,null,null,null,"COMPLEX"]
["Replace central heating boiler","complex","Request the installed product specifications and determine sample size required for verification to be inspected during site visit; refer to Inspection Form or invoices. Take note of where these are installed (i.e. highlight on printout of property map if in common areas) for easier access during the site visit; e.g. hot water utility closets and/or boiler room.","Take photos of nameplate to confirm model matches with product specifications. If needing to cycle through control settings, consult property staff and refer to user manual prior to doing so as this can impact default or custom conditions.",null,null,null,null,"COMPLEX"]
["Replace individual heating boiler","basic","Request the installed product specifications and determine sample size required for verification to be inspected during site visit; refer to Inspection Form or invoices. Take note of where these are installed (i.e. highlight on printout of unit layout if in apartments) for easier access during the site visit; e.g. hot water utility closets.","Take photos of nameplate to confirm model matches with product specifications. If needing to cycle through control settings, consult property staff and refer to user manual prior to doing so as this can impact default or custom conditions; if using a thermostat, operability can be verified by adjusting from off state to the temperature setpoint.",null,null,null,null,"BASIC"]
["Replace burner","complex","Request the installed product specifications and determine sample size required for verification to be inspected during site visit; refer to Inspection Form or invoices. Take note of where these are installed (i.e. highlight on printout of unit layout if in apartments or on property map if using a central system) for easier access during the site visit; e.g. furnace utility closets.","Take photos of nameplate to confirm model matches with product specifications. If needing to cycle through control settings, consult property staff and refer to user manual prior to doing so as this can impact default or custom conditions; if using a thermostat, operability can be verified by adjusting from off state to the temperature setpoint.",null,null,null,null,"COMPLEX"]
["Insulate boiler room","basic","Request the installed product specifications and determine sample size required for verification to be inspected during site visit; refer to Inspection Form or invoices.","Take photos of insulation around the boiler, access points, distribution pipes, pumps, walls and surrounding any openings; measure thickness and length of insulated and noninsulated sections and verify these match the product specifications.",null,null,null,null,"BASIC"]
["Insulate boiler","basic","Request the installed product specifications and determine sample size required for verification to be inspected during site visit; refer to Inspection Form or invoices. Take note of where these are installed (i.e. highlight on printout of property map if in common areas) for easier access during the site visit; e.g. hot water utility closets and/or boiler room.","Take photos of insulation around the boiler or hot water tank; measure thickness and length of insulated and noninsulated sections and verify these match the product specifications.",null,null,null,null,"BASIC"]
["Add energy recovery","complex","Review the specification in the HPB and Inspection Form.","Take photos of nameplate to confirm model matches with product specifications. Verification of operability contingent on type of upgrade.",null,null,null,null,"COMPLEX"]
["Convert system from steam to hot water","complex","Request the installed product specifications and determine sample size required for verification to be inspected during site visit; refer to Inspection Form or invoices. Take note of where these are installed (i.e. highlight on printout of property map if in common areas) for easier access during the site visit; e.g. hot water utility closets and/or water heater room.","Take photos of nameplate to confirm model matches with product specifications. If needing to cycle through control settings, consult property staff and refer to user manual prior to doing so as this can impact default or custom conditions.",null,null,null,null,"COMPLEX"]
["Upgrade whole building lighting","basic","Request the installed product specifications and determine sample size required for verification of each fixture type to be inspected during site visit; refer to Inspection Form or invoices for full fixture quantities by type and location. Take note of where on the property these are installed (e.g. highlight on printout of property map) for easier access during the site visit.","Verify lighting fixtures according to determined sample size, confirming they are installed, operational and match the product specifications. ",null,null,null,null,"BASIC"]
["Upgrade common area lighting","basic","Request the installed product specifications and determine sample size required for verification of each fixture type to be inspected during site visit; refer to Inspection Form or invoices for full fixture quantities by type and location. Take note of where on the property these are installed (e.g. highlight on printout of property map) for easier access during the site visit.","Verify lighting fixtures according to determined sample size, confirming they are installed, operational and match the product specifications. ",null,null,null,null,"BASIC"]
["Upgrade exterior lighting","basic","Request the installed product specifications and determine sample size required for verification of each fixture type to be inspected during site visit; refer to Inspection Form or invoices for full fixture quantities by type and location. Take note of where on the property these are installed (e.g. highlight on printout of property map) for easier access during the site visit.","Verify lighting fixtures according to determined sample size, confirming they are installed, operational and match the product specifications. ",null,null,null,null,"BASIC"]
["Upgrade in-unit lighting","basic","Request the installed product specifications and determine sample size required for verification of each fixture type to be inspected during site visit; refer to Inspection Form or invoices for full fixture quantities by type and location. Take note of where in the unit these are installed (e.g. highlight on printout of unit layout) for easier access during the site visit.","Verify lighting fixtures according to determined sample size, confirming they are installed, operational and match the product specifications. ",null,null,null,null,"BASIC"]
["Install sensors/controls","basic","Request the installed product specifications and user manual if applicable; refer to Inspection Form or invoices. Take note of where the system is installed (i.e. highlight on printout of property map) for easier access during the site visit; e.g. boiler or domestic hot water utility closet.","Take photos of sensors and controls including nameplate, where visible, verifying that this matches with specification. If needing to cycle through control settings, consult property staff and refer to user manual prior to doing so as this can impact default or custom conditions. Visit stock room to document surplus sensors if those installed are inaccessible (e.g. inline temperature sensors).",null,null,null,null,"BASIC"]
["Air seal envelope/weather-strip","basic","Take note of where these are installed (e.g. highlight on printout of unit layout if in apartments or on property map if in common areas) for easier access during the site visit.","Take photo of windows according to minimum sample size; visually confirm that weather strip forms a proper seal around fenestration.",null,null,null,null,"BASIC"]
["Increase wall insulation","basic","Request the installed product specifications and determine sample size required for verification to be inspected during site visit; refer to Inspection Form or invoices.","If visual confirmation is necessary, request that staff turn off power circuit to an electrical outlet and confirm that power is off using a voltmeter. Only once power is off, outlet cover can be safely removed and photos can be taken around outlet box to confirm insulation.",null,null,null,null,"BASIC"]
["Increase roof insulation","basic","Request the installed product specifications and determine sample size required for verification to be inspected during site visit; refer to Inspection Form or invoices.","Take photos of roof exterior and interior if safely accessible.",null,null,null,null,"BASIC"]
["Add attic insulation","basic","Request the installed product specifications and determine sample size required for verification to be inspected during site visit; refer to Inspection Form or invoices.","Access the attic space within apartments to confirm that insulation is installed and confirm it matches the product specifications. Take photos of insulation.",null,null,null,null,"BASIC"]
["Insulate foundation","basic","Request the installed product specifications and determine sample size required for verification to be inspected during site visit; refer to Inspection Form or invoices.","Access the crawl space within apartments to confirm that insulation is installed and confirm it matches the product specifications. Take photos of insulation.",null,null,null,null,"BASIC"]
["Replace roof","basic","Request the installed product specifications; refer to Inspection Form or invoices. Take note on which buildings this is installed at the property.","Take photos of roof exterior and interior if safely accessible.",null,null,null,null,"BASIC"]
["Replace windows","basic","Request the installed product specifications and determine sample size required for verification of each window type to be inspected during site visit; refer to Inspection Form or invoices for full quantities by type and location. Take note of where these are installed (i.e. highlight on printout of unit layout if in apartments or on property map if in common areas) for easier access during the site visit.","Take photo of windows according to minimum sample size; verify these are operable and match the specifications.",null,null,null,null,"BASIC"]
["Replace doors","basic","Request the installed product specifications and determine sample size required for verification of each door type to be inspected during site visit; refer to Inspection Form or invoices for full quantities by type and location. Take note of where these are installed (i.e. highlight on printout of unit layout if in apartments or on property map if in common areas) for easier access during the site visit.","Take photo of doors according to minimum sample size; verify these are operable and match the specifications.",null,null,null,null,"BASIC"]
["Add storm windows","basic","Request the installed product specifications and determine sample size required for verification of each window type to be inspected during site visit; refer to Inspection Form or invoices for full quantities by type and location. Take note of where these are installed (i.e. highlight on printout of unit layout if in apartments or on property map if in common areas) for easier access during the site visit.","Take photo of windows according to minimum sample size; verify these are operable and match the specifications.",null,null,null,null,"BASIC"]
["Add window films","basic","Take note of where these are installed (i.e. highlight on printout of unit layout if in apartments or on property map if in common areas) for easier access during the site visit.","Take photo of windows according to minimum sample size; visually confirm that films are installed on panes.",null,null,null,null,"BASIC"]
["Install or replace solar screens","basic","Take note of where these are installed (i.e. highlight on printout of unit layout if in apartments or on property map if in common areas) for easier access during the site visit.","Take photo of windows according to minimum sample size; visually confirm that these are installed on panes.",null,null,null,null,"BASIC"]
["Install cool/green roof","complex","Request the installed product specifications; refer to Inspection Form or invoices. Take note on which buildings this is installed at the property.","Take photos of roof exterior and interior if safely accessible.",null,null,null,null,"COMPLEX"]
["Install photovoltaic system","complex","Request the installed product specifications; refer to Inspection Form or invoices. Take note of where the system is installed (i.e. highlight on printout of property map) for easier access during the site visit; e.g. rooftop and/or ground mounted.","Take photos of PV panels and balance of system components; i.e. racks, inverters, batteries, charge controller, AC/DC disconnects, power conditioning units and AC panel including nameplate of components where visible. Take photos of meter connections and readings. Verify these are operable and match the specifications.",null,null,null,null,"COMPLEX"]
["Install photovoltaic system with battery storage","complex","Request the installed product specifications; refer to Inspection Form or invoices. Take note of where the system is installed (i.e. highlight on printout of property map) for easier access during the site visit; e.g. rooftop and/or ground mounted.","Take photos of PV panels and balance of system components; i.e. racks, inverters, batteries, charge controller, AC/DC disconnects, power conditioning units and AC panel including nameplate of components where visible. Take photos of meter connections and readings. Verify these are operable and match the specifications.",null,null,null,null,"COMPLEX"]
["Install battery storage","complex","Request the installed product specifications; refer to Inspection Form or invoices. Take note of where the system is installed (i.e. highlight on printout of property map) for easier access during the site visit; e.g. rooftop and/or ground mounted.","Take photos of batteries including nameplate of components where visible. Verify these are operable and match the specifications.",null,null,null,null,"COMPLEX"]
["Install wind energy system","complex","Request the installed product specifications; refer to Inspection Form or invoices. Take note of where the system is installed (i.e. highlight on printout of property map) for easier access during the site visit; e.g. rooftop and/or ground mounted.","Take photos of wind turbine and balance of system components; i.e. inverters, batteries, charge controller/regulator, AC/DC disconnects, and AC panel including nameplate of components where visible. Take photos of meter connections and readings. Verify these are operable and match the specifications.",null,null,null,null,"COMPLEX"]
["Upgrade controls","complex","Request the installed product specifications and user manual if applicable; refer to Inspection Form or invoices. Take note of where the system is installed (i.e. highlight on printout of property map) for easier access during the site visit.","Take photos of controls including nameplate, verifying that this matches with specification. If needing to cycle through control settings, consult property staff and refer to user manual prior to doing so as this can impact default or custom conditions.",null,null,null,null,"COMPLEX"]
["Add pipe insulation","basic","Request the installed product specifications and determine sample size required for verification to be inspected during site visit; refer to Inspection Form or invoices. Take note of where these are installed (i.e. highlight on printout of property map if in common areas) for easier access during the site visit; e.g. domestic hot water utility closets and/or boiler room.","Take photos of pipe insulation around the boiler or hot water tank; measure thickness and length of insulated and noninsulated sections and verify these match the product specifications.",null,null,null,null,"BASIC"]
["Replace with higher efficiency pump","basic","Request the installed product specifications and determine sample size required for verification to be inspected during site visit; refer to Inspection Form or invoices for full quantities by type and location. Take note of where these are installed (i.e. highlight on property map) for easier access during the site visit; e.g. boiler room.","Take photo of pump; verify these match the product specifications.",null,null,null,null,"BASIC"]
["Replace with variable speed pump","basic","Request the installed product specifications and determine sample size required for verification to be inspected during site visit; refer to Inspection Form or invoices for full quantities by type and location. Take note of where these are installed (i.e. highlight on property map) for easier access during the site visit; e.g. pool room.","Take photo of variable speed pump; verify these match the product specifications. If needing to cycle through speed settings, consult property staff and refer to user manual prior to doing so as this can impact default or custom conditions.",null,null,null,null,"BASIC"]
["Add recirculating pumps","complex","Request the installed product specifications and determine sample size required for verification to be inspected during site visit; refer to Inspection Form or invoices for full quantities by type and location. Take note of where these are installed (i.e. highlight on property map) for easier access during the site visit; e.g. domestic hot water utility closets.","Take photo of recirculating pump; verify these match the product specifications.",null,null,null,null,"COMPLEX"]
["Balance distribution system","complex","Request the installed product specifications; refer to Inspection Form or invoices for full quantities by type and location.","Take photos of any physical upgrades made as part of the system balancing.",null,null,null,null,{"$f":"UPPER(B72)","v":"COMPLEX"}]
["Replace steam traps","basic","Request the installed product specifications and determine sample size required for verification to be inspected during site visit; refer to Inspection Form or invoices for full quantities by type and location.","Take photo of the steam traps, typically found on the inlet pipe to the radiator, and verify these match the product specifications. Confirm there is no condensate discharge or steam leaks. Verify operability of the unit by measuring temperature of the trap inlet using an infrared thermometer; condensate temperature should approximate that of saturated steam.",null,null,null,null,"BASIC"]
["Install thermostatic radiator valves","basic","Request the installed product specifications and determine sample size required for verification to be inspected during site visit; refer to Inspection Form or invoices for full quantities by type and location.","Take photo of the thermostatic valve, typically found on the inlet pipe to the radiator, and verify these match the product specifications. Adjust the setting of the valve, by turning its head from the lowest number or off to a higher setpoint, and confirm operability of the unit by measuring temperature of the pipe downstream of valve in both settings using an infrared thermometer.",null,null,null,null,"BASIC"]
["Install or replace condensate return system","complex","Request the installed product specifications and determine sample size required for verification to be inspected during site visit; refer to Inspection Form or invoices for full quantities by type and location. Take note of where these are installed (i.e. highlight on property map) for easier access during the site visit; e.g. rooftop.","Take photo of variable speed pump; verify these match the product specifications. If needing to cycle through settings, consult property staff and refer to user manual prior to doing so as this can impact default or custom conditions.",null,null,null,null,"COMPLEX"]
["Replace chiller","complex","Request the installed product specifications and determine sample size required for verification to be inspected during site visit; refer to Inspection Form or invoices for full quantities by type and location. Take note of where these are installed (i.e. highlight on property map) for easier access during the site visit; e.g. rooftop.","Take photo of chiller nameplate; verify these match the product specifications. If needing to cycle through settings, consult property staff and refer to user manual prior to doing so as this can impact default or custom conditions.",null,null,null,null,"COMPLEX"]
["Install VSD on electric centrifugal chillers","complex","Request the installed product specifications and determine sample size required for verification to be inspected during site visit; refer to Inspection Form or invoices for full quantities by type and location. Take note of where these are installed (i.e. highlight on property map) for easier access during the site visit; e.g. rooftop.","Take photo of variable speed drive nameplate; verify these match the product specifications. If needing to cycle through speed settings, consult property staff and refer to user manual prior to doing so as this can impact default or custom conditions.",null,null,null,null,"COMPLEX"]
["Install low-flush toilets","basic","Request invoice and product specification sheets for low flush toilets from property manager; input cost value, amount of toilets and nameplate ratings in gallons per flush (GPF). Determine necessary sample size based on number of installed units.","Record apartment number. Take photo of toilet with close up of nameplate rating, typically between the seat and tank or engraved within the tank. Verify that it is operational and matches the rating in the specification sheets.",null,null,null,null,"BASIC"]
["Install low-flow bath faucets","basic","Request invoice and product specification sheets for low flow fixtures from property manager; input cost value, amount of aerators, and nameplate ratings in gallons per minute (GPM).  Determine necessary sample size based on number of installed units. IF SPEC IS 0.5 GPM: a 1.0 GPM fixture will be considered compliant. ","Visit overstock room; i.e. supply closet or maintenance office. Take photos of nameplate information on aerator boxes if available. Record apartment number. Take photo of fixture aerator with close up of nameplate rating, typically engraved on its casing. Verify that it is operational and matches the rating in the specification sheets.",null,null,null,null,"BASIC"]
["Install low-flow kitchen faucets","basic","Request invoice and product specification sheets for low flow fixtures from property manager; input cost value, amount of aerators, and nameplate ratings in gallons per minute (GPM).  Determine necessary sample size based on number of installed units.","Visit overstock room; i.e. supply closet or maintenance office. Take photos of nameplate information on aerator boxes if available. Record apartment number. Take photo of fixture aerator with close up of nameplate rating, typically engraved on its casing. Verify that it is operational and matches the rating in the specification sheets.",null,null,null,null,"BASIC"]
["Install low-flow showerheads","basic","Request invoice and product specification sheets for low flow fixtures from property manager; input cost value, amount of showerheads and nameplate ratings in gallons per minute (GPM).  Determine necessary sample size based on number of installed units.","Visit overstock room; i.e. supply closet or maintenance office. Take photos of nameplate information on aerator boxes if available. Record apartment number. Take photo of showerhead with close up of nameplate rating, typically engraved on its casing. Verify that it is operational and matches the rating in the specification sheets.",null,null,null,null,"BASIC"]
["Implement water efficient irrigation","basic","Request the installed product specifications and determine sample size required for verification to be inspected during site visit; refer to Inspection Form or invoices.","Take photos of nameplate to confirm model matches with product specifications, as well as photo documentaton of irrigation system on landscape. If needing to cycle through control settings on irrigation console, consult property staff and refer to user manual prior to doing so as this can impact default or custom conditions.",null,null,null,null,"BASIC"]
["Install pool cover","basic","Request invoice and product specification for pool cover.","Take photos of pool cover to confirm this matches the product specifications.",null,null,null,null,"BASIC"]
["Replace or upgrade central water heater","complex","Request the installed product specifications and determine sample size required for verification to be inspected during site visit; refer to Inspection Form or invoices. Take note of where these are installed (i.e. highlight on printout of property map if in common areas) for easier access during the site visit; e.g. hot water utility closets and/or water heater room.","Take photos of nameplate to confirm model matches with product specifications. If needing to cycle through control settings, consult property staff and refer to user manual prior to doing so as this can impact default or custom conditions.",null,null,null,null,"COMPLEX"]
["Replace or upgrade individual water heater","basic","Request the installed product specifications and determine sample size required for verification to be inspected during site visit; refer to Inspection Form or invoices. Take note of where these are installed (i.e. highlight on printout of unit layout if in apartments) for easier access during the site visit; e.g. hot water utility closets.","Take photos of nameplate to confirm model matches with product specifications. If needing to cycle through control settings, consult property staff and refer to user manual prior to doing so as this can impact default or custom conditions; if using a thermostat, operability can be verified by adjusting from off state to the temperature setpoint.",null,null,null,null,"BASIC"]
["Install solar hot water system","complex","Request the installed product specifications; refer to Inspection Form or invoices. Take note of where the system is installed (i.e. highlight on printout of property map) for easier access during the site visit; e.g. rooftop and/or ground mounted.","Take photos of solar hot water panels and balance of system components; i.e. racks, circulation pumps and panels, plumbing, mixing valves and storage tank including nameplate of components where visible. Verify these are operable and match the specifications.",null,null,null,null,"COMPLEX"]
["Separate DHW from heating","complex","Request the installed product specifications and determine sample size required for verification to be inspected during site visit; refer to Inspection Form or invoices. Take note of where these are installed (i.e. highlight on printout of property map if in common areas) for easier access during the site visit; e.g. domestic hot water utility closets and/or boiler room.","Take photos of nameplate to confirm model matches with product specifications. If needing to cycle through control settings, consult property staff and refer to user manual prior to doing so as this can impact default or custom conditions.",null,null,null,null,"COMPLEX"]
["Add drive controls","complex","Request the installed product specifications and user manual if applicable; refer to Inspection Form or invoices. Take note of where the system is installed (i.e. highlight on printout of property map) for easier access during the site visit.","Take photos of controls including nameplate, verifying that this matches with specification. If needing to cycle through control settings, consult property staff and refer to user manual prior to doing so as this can impact default or custom conditions.",null,null,null,null,"COMPLEX"]
["Add VSD motor controller","basic","Request the installed product specifications and determine sample size required for verification to be inspected during site visit; refer to Inspection Form or invoices for full quantities by type and location. Take note of where these are installed (i.e. highlight on property map) for easier access during the site visit; e.g. rooftop.","Take photo of variable speed drive nameplate; verify these match the product specifications. If needing to cycle through speed settings, consult property staff and refer to user manual prior to doing so as this can impact default or custom conditions.",null,null,null,null,"BASIC"]
["Upgrade elevator technology","complex","Request the installed product specifications and determine sample size required for verification to be inspected during site visit; refer to Inspection Form or invoices for full quantities by type and location.","Take photos in elevator room of nameplates for any upgrades; e.g. regenerative drives, or microprocessor controls in place of electromechanical relays.",null,null,null,null,"COMPLEX"]
["Install CHP/cogeneration systems","complex","Request the installed product specifications; refer to Inspection Form or invoices. Take note of where the system is installed (i.e. highlight on printout of property map) for easier access during the site visit.","Take photos of CHP turbine or engine and balance of system components; i.e. inverters, heat exchangers, charge controller/regulator, AC/DC disconnects, AC panel and storage tanks (if applicable) including nameplate of components where visible. Take photos of meter connections and readings. Verify these are operable and match the specifications.",null,null,null,null,"COMPLEX"]
["Install fuel cells","complex","Request the installed product specifications; refer to Inspection Form or invoices. Take note of where the system is installed (i.e. highlight on printout of property map) for easier access during the site visit.","Take photos of fuel cells and balance of system components; i.e. inverters, heat exchangers, charge controller/regulator, AC/DC disconnects, AC panel and storage tanks (if applicable) including nameplate of components where visible. Take photos of meter connections and readings. Verify these are operable and match the specifications.",null,null,null,null,"COMPLEX"]
["Install microturbines","complex","Request the installed product specifications; refer to Inspection Form or invoices. Take note of where the system is installed (i.e. highlight on printout of property map) for easier access during the site visit.","Take photos of microturbines and balance of system components; i.e. inverters, batteries, charge controller/regulator, AC/DC disconnects, and AC panel including nameplate of components where visible. Take photos of meter connections and readings. Verify these are operable and match the specifications.",null,null,null,null,"COMPLEX"]
["Convert fuels","complex","Request the installed product specifications; refer to Inspection Form or invoices.","Contingent on type of fuel conversion.",null,null,null,null,"COMPLEX"]

{"sheet":"LoanPropdat","index":9,"n_rows":1,"n_cols":14,"rows_kept":1,"cut":false,"hidden":true,"merged":[]}
["bp_id","fannie_mae_loan_number","collateral_reference_number","property_linkage_id","property_name","HPBVendor","servicer_name","origination_date","verification_expected_ewem_installation_completion","property_address","city","state","zip_code","property_unit_count"]

{"sheet":"EWEMdat","index":10,"n_rows":1,"n_cols":11,"rows_kept":1,"cut":false,"hidden":true,"merged":[]}
["bp_collateral_id","fannie_mae_loan_number","servicer_name","EWEMNumber","EWEMCategory","EWEMName","EWEMDescription","LocationServed","Quantity","NumberOfUnits","InstalledCost"]

{"sheet":"Updates","index":11,"n_rows":1,"n_cols":2,"rows_kept":1,"cut":false,"hidden":true,"merged":[]}
["2021-09-10","Updated the Observations sheet to account for 'install low flow fixtures' and determine if they are bath or kitchen and calculate compliance accordingly. "]

{"sheet":"SecurityKey","index":12,"n_rows":4324,"n_cols":3,"rows_kept":4324,"cut":false,"hidden":true,"merged":[]}
["LoanID + Linkage ID mashup","BP ID","Key"]
["1717466829169640",1,{"$f":"VLOOKUP('Property Info'!B8&'Property Info'!B11,SecurityKey!A:B,2,FALSE)","v":3207}]
["1717473291/1717473292/1717475746169980",2]
["171746735942931",3]
["1717467881111857",4]
["1717467880150697",5]
["1717468153172334",6]
["1717468071136259",7]
["1717468064172176",8]
["171746794711415",9]
["1717468502172854",10]
["1717468584151484",11]
["1717468161172435",12]
["1717468239172499",13]
["1717468308172287",14]
["1717468309172287",14]
["171746816728220",15]
["1717469198174057",16]
["171746858610017",17]
["1717469552174573",18]
["1717469574174611",19]
["1717468805173358",20]
["1717469078173849",21]
["1717469646147090",22]
["1717468766173313",23]
["1717471435/1717471655/1717474664173184",24]
["1717469561156791",25]
["1717469562144444",26]
["1717469143174012",27]
["171746906190867",28]
["1717468993173646",29]
["1717468985154157",30]
["1717469070173805",31]
["1717468949173658",32]
["1717468987173600",33]
["171746968918434",34]
["1717469995175073",35]
["1717469690174727",36]
["1717469227174202",37]
["1717469224174203",38]
["1717469667174677",39]
["1717469720174672",40]
["1717470018175178",41]
["1717470019175183",42]
["1717469899175010",43]
["1717470049123150",44]
["1717470766176318",45]
["1717470051175199",46]
["1717469598174631",47]
["1717469681174665",48]
["1717469641174663",49]
["1717469553174586",50]
["171746977824493",51]
["1717469671174709",52]
["1717469765174757",53]
["1717469860175217",54]
["171747008423650",55]
["171746983545659",56]
["1717470400175614",57]
["1717469877109443",58]
["171747084026696",59]
["1717470137153893",60]
["1717470165175250",61]
["171747016617408",62]
["171747014559529",63]
["1717470235383",64]
["1717470232157265",65]
["1717470344132979",66]
["171747013583650",67]
["1717470650176002",68]
["1717470811176347",69]
["1717470812176346",70]
["1717470296175517",71]
["171747052922126",72]
["1717470767176276",73]
["1717470103113488",74]
["171747037560510",75]
["1717470728168863",76]
["1717470599175574",77]
["1717470826176309",78]
["171747043713534",79]
["171747056360512",80]
["1717470580175899",81]
["1717470304175556",82]
["1717470949176619",83]
["1717470567175840",84]
["1717470806176358",85]
["171747030890661",86]
["1717470698134954",87]
["1717470656176023",88]
["1717470257175530",89]
["1717470831134453",90]
["1717470509175782",91]
["1717470832133596",92]
["1717470470175783",93]
["1717470510175784",94]
["1717470700153249",95]
["171747058953477",96]
["1717470540175844",97]
["1717470539175845",98]
["171747047135454",99]
["171747052477737",100]
["1717470841176420",101]
["1717470600175929",102]
["171747159860306",103]
["1717471102176796",104]
["1717470905162133",105]
["171747081328870",106]
["1717471236177139",107]
["1717470341175888",108]
["171747073412347",109]
["1717470515175937",111]
["171747068826995",112]
["171747080947252",113]
["1717470612175890",114]
["1717470467175694",115]
["1717470643175879",116]
["171747082824913",117]
["1717470834123158",118]
["1717470513175862",119]
["171747070482375",120]
["171747070382376",121]
["1717470625175981",122]
["171747042222484",123]
["1717470774158156",124]
["1717470711176201",125]
["1717470823176365",126]
["1717470871149715",127]
["1717470662155019",128]
["171747064735174",129]
["1717470659144515",130]
["171747108447895",131]
["1717470814176345",132]
["1717470810108608",133]
["1717470761176305",134]
["1717470710176375",135]
["1717471264177167",136]
["1717471069176764",137]
["1717471252177158",138]
["1717470925176484",139]
["1717470798109449",140]
["1717470877176356",141]
["1717470848116933",142]
["1717470628/171747062914213",143]
["1717470628/171747062933417",144]
["1717470628/1717470629131371",145]
["1717470628/171747062919830",146]
["1717471487177613",147]
["1717470733176307",148]
["1717470747153250",149]
["1717471138176797",150]
["1717470984176654",151]
["171747097979655",152]
["1717470978142581",153]
["1717470910167139",154]
["1717470836176392",155]
["1717471347154909",156]
["1717470879140112",157]
["1717470699176386",158]
["171747087819075",159]
["1717470735119792",160]
["171747255371118",161]
["1717471113176825",162]
["1717470873176315",163]
["1717470936176526",164]
["1717471595177808",165]
["1717471131176832",166]
["1717470874164990",167]
["1717470893176408",168]
["1717470839176403",169]
["1717471317177161",170]
["1717471070176794",171]
["1717471227177116",172]
["1717471004176723",173]
["1717471303177255",174]
["171747094059442",175]
["171747123316436",176]
["171747141517017",177]
["1717471416177410",178]
["1717471417177411",179]
["1717471062176810",180]
["171747111817382",181]
["1717471092176800",182]
["1717471873178274",184]
["171747141961087",185]
["1717470904176589",186]
["1717471145176840",187]
["1717471224177053",188]
["1717471180176864",189]
["1717471081156782",190]
["171747140038206",191]
["171747140525843",193]
["1717471121108852",194]
["1717471139176844",195]
["1717471127176861",196]
["1717471068176758",197]
["1717471268177443",198]
["1717470990176697",199]
["1717470974176656",200]
["1717470963123836",201]
["1717471107176850",202]
["1717471355177341",203]
["1717471203124915",204]
["1717471351105993",205]
["1717471024176885",206]
["1717471116176790",207]
["1717471258168611",208]
["1717471046176769",209]
["1717471148176860",210]
["1717471147128610",211]
["171747130438084",212]
["1717471305177262",213]
["1717471307177137",214]
["1717471340161602",215]
["1717471204177059",216]
["171747142021982",217]
["1717471428177361",218]
["1717471427177407",219]
["1717471421177444",220]
["171747142625995",221]
["171747142259525",222]
["1717471435/1717471655/1717474664148132",223]
["171747125462129",224]
["171747138658343",225]
["1717471596177811",226]
["171747116910195",228]
["1717471623177813",229]
["171747137415465",230]
["1717472089178667",231]
["1717472090178668",232]
["1717471474177633",233]
["1717471747178075",234]
["1717471459177594",235]
["1717471409177366",236]
["171747142941809",237]
["1717471396147938",238]
["1717471196177058",239]
["1717471662177860",240]
["1717471456177486",241]
["1717471290177266",242]
["1717471397177466",243]
["1717471402145766",244]
["17174713319463",245]
["1717471612153094",246]
["1717471333177269",247]
["1717471214177096",248]
["1717466829169640",249]
["171747132617166",249]
["171747137060471",250]
["1717471467177592",251]
["1717471279177384",252]
["171747233132863",254]
["1717471336177270",255]
["1717471804158892",257]
["1717471448177509",258]
["171747151633478",259]
["1717471533177741",260]
["171747150624047",261]
["1717471527138229",262]
["1717471548128199",263]
["1717471759131868",264]
["1717471406177349",265]
["1717471871178275",266]
["17174716373832",267]
["171747133418257",268]
["1717471874178276",269]
["1717472023178520",270]
["1717472024111272",271]
["1717471489177700",272]
["1717471529177705",273]
["1717471689177910",274]
["1717471261177272",275]
["1717471824178182",276]
["1717471335177396",277]
["1717471540158575",278]
["1717471390177345",279]
["1717471805105701",280]
["1717471581177820",281]
["1717471564177863",282]
["171747190914406",283]
["1717471672177926",284]
["1717471578164041",285]
["171747143450951",286]
["1717471743178054",287]
["1717471840158890",288]
["1717471553177782",289]
["1717471399167936",290]
["1717471437/1717471438/1717474980177284",291]
["1717471437/1717471438/1717474980177282",292]
["1717471437/1717471438/1717474980177281",293]
["1717471437/1717471438/1717474980177285",294]
["1717471437/1717471438/1717474980177283",295]
["1717471534177846",296]
["1717471687177843",297]
["1717472160178669",298]
["1717471512177701",299]
["1717471483177634",300]
["1717472116178584",301]
["1717471891178268",302]
["1717471569122314",303]
["171747183637841",304]
["1717471977153870",305]
["1717471917178326",306]
["1717471714177991",307]
["1717471608153673",308]
["1717472165123890",309]
["1717471582177825",310]
["1717471583177869",311]
["1717471547177789",312]
["1717471955178270",313]
["1717471835178251",314]
["1717471666128517",315]
["1717471742178079",316]
["171747205581630",317]
["1717472113178582",318]
["1717471910148009",319]
["1717471848178252",320]
["1717472046152523",321]
["1717471841165346",322]
["171747177920714",323]
["171747158416069",324]
["1717471679150482",325]
["1717471877178278",326]
["1717471610143851",327]
["1717471685177849",328]
["1717471673155024",329]
["1717471594161237",330]
["171747154154112",331]
["1717472138119803",332]
["1717472137178687",333]
["171747182311923",334]
["1717472400179183",335]
["1717471538177876",336]
["1717471815178184",337]
["1717471481100",338]
["1717471643177833",339]
["1717471575130473",340]
["1717471609177852",341]
["171747166720871",342]
["1717471694177880",343]
["1717471486177848",344]
["1717472465179308",345]
["1717471782178186",346]
["1717472994/1717472995/1717472996/1717473293/1717471521177696",347]
["1717471719178012",348]
["1717471709177990",349]
["1717471803178159",350]
["1717471628177850",351]
["171747185026400",352]
["1717471710157732",353]
["1717471787151838",354]
["171747172148134",355]
["1717471790178280",356]
["1717471947178266",357]
["171747210521947",358]
["171747210760354",359]
["171747210659690",360]
["1717472111178691",361]
["1717471740178335",362]
["171747196231651",363]
["1717472314178911",364]
["1717471707178013",365]
["1717472161178748",366]
["1717471844147360",367]
["171747432513748",368]
["171747206420221",369]
["1717472152178671",370]
["1717471852178248",371]
["171747186256397",372]
["171747185822924",373]
["171747185923112",374]
["171747203165204",375]
["1717472112178693",376]
["1717471972178411",377]
["171747172858434",378]
["1717472907179799",379]
["1717472058178711",380]
["1717471918178292",381]
["1717471819120141",382]
["1717472286178829",383]
["1717471736133810",384]
["1717471738133820",385]
["1717471737133819",386]
["1717471795141341",388]
["1717472134178688",389]
["171747193861012",390]
["1717472240178741",392]
["1717472013178496",393]
["171747189824524",394]
["1717471957178303",395]
["1717472597126404",396]
["1717471905178228",397]
["171747189470955",398]
["1717472473179245",399]
["1717471942159437",400]
["1717471965178271",401]
["171747241230760",402]
["1717473203180339",403]
["1717472035178477",404]
["171747180742882",405]
["1717472045122977",406]
["171747181439297",407]
["1717471904115621",408]
["171747185561083",409]
["1717471856140094",410]
["1717472391179105",411]
["171747191380793",412]
["1717471923147841",413]
["1717472304178826",414]
["1717472305178828",415]
["1717471758178084",416]
["1717471755112822",417]
["171747175765136",418]
["1717471821178475",419]
["1717471828178476",420]
["1717472276151180",421]
["171747193024886",422]
["1717471857178225",423]
["171747207035377",424]
["1717471931178321",425]
["1717471906155069",426]
["171747258760796",427]
["1717472427105935",428]
["1717471908178267",429]
["1717472272178752",430]
["1717471818178197",431]
["1717472040108572",432]
["171747204126246",433]
["1717471946178329",434]
["171747203419215",435]
["1717473278180457",436]
["171747197415341",437]
["1717472191178757",438]
["1717472128178590",439]
["1717472467128631",440]
["1717472132178684",441]
["1717472506179246",442]
["1717472288152193",443]
["1717472353163791",444]
["1717472463179230",445]
["1717472316178889",446]
["1717472492179228",447]
["1717472945/1717472946142780",448]
["171747215828244",449]
["1717472129178696",450]
["1717472431179185",451]
["1717472151178761",452]
["1717472050178764",453]
["1717471995178522",454]
["1717472118178765",455]
["1717472081142231",456]
["171747229424219",457]
["1717472101178591",458]
["171747197553666",459]
["1717472429119804",460]
["1717472119178767",461]
["1717472195178807",462]
["171747221546456",463]
["1717472142142752",464]
["1717472143142745",465]
["171747285122475",466]
["1717472306154272",467]
["171747230730914",468]
["1717472057178592",469]
["1717472066178593",470]
["1717472006154848",471]
["1717472018178483",472]
["1717473066180165",473]
["1717473065109622",474]
["1717472231178770",475]
["1717472193178602",476]
["1717472501179247",477]
["1717472649179614",478]
["1717472076178685",479]
["171747218930166",480]
["1717472247178778",481]
["171747295423052",482]
["1717472135178745",483]
["1717472212151164",484]
["1717472233178666",485]
["1717472213171284",486]
["1717472173178810",487]
["171747233535386",488]
["1717472217124841",489]
["1717472218124816",490]
["1717472219178749",491]
["1717472220124817",492]
["1717472221124801",493]
["1717472223178746",494]
["1717472222178750",495]
["1717472224178747",496]
["1717472225124815",497]
["1717472131178627",498]
["1717472426165707",499]
["1717472100149495",500]
["1717473016179999",501]
["171747281486564",502]
["1717472374179106",503]
["1717472216178751",504]
["1717472196178739",505]
["1717472147152015",506]
["1717472146153035",507]
["1717472387179104",508]
["171747226522560",509]
["1717472376179100",510]
["1717472386179125",511]
["1717472377179099",512]
["1717473760171347",513]
["1717472122178804",514]
["1717472148158155",515]
["1717471982133379",516]
["1717472324144528",517]
["1717472082150995",518]
["17174722498998",519]
["1717471984178300",520]
["1717471983178301",521]
["1717472102178629",522]
["1717472556179320",523]
["1717472293178891",524]
["1717472268147319",525]
["1717472199178604",526]
["1717472136178794",527]
["1717472908129813",528]
["1717472179124483",529]
["1717472469179232",530]
["1717472283178795",531]
["1717472299178796",532]
["1717473482180854",534]
["1717472284178848",535]
["1717472298178801",536]
["171747215323144",537]
["1717472279178743",538]
["1717472366179039",539]
["1717472342179036",540]
["1717472504117249",541]
["171747244860345",542]
["1717472528179316",543]
["1717472365170293",544]
["1717472511116961",545]
["1717472542179322",546]
["171747250343164",547]
["1717472392151153",548]
["1717472428179188",549]
["1717472793179612",550]
["1717472407120004",551]
["1717472813161585",552]
["1717472406120005",553]
["1717472404120019",554]
["1717472405119837",555]
["1717472409179311",556]
["1717472517179266",557]
["1717472291178560",558]
["1717472291178561",559]
["1717472544152752",560]
["1717473091180186",561]
["171747276138325",562]
["17174724082993",563]
["1717472838122854",564]
["171747248539293",565]
["1717472385179078",566]
["1717472508179435",567]
["1717472442179162",568]
["1717472806149364",569]
["1717472595179413",570]
["1717472396179146",571]
["1717473138180336",572]
["1717472956163329",573]
["1717472509179281",574]
["171747261230928",575]
["171747236929219",576]
["1717472573144299",577]
["1717472590166901",578]
["1717472773135501",579]
["1717472772133440",580]
["1717472817143567",581]
["1717472640179583",582]
["1717472771134452",583]
["1717472770179584",584]
["171747255491636",585]
["171747255526307",586]
["1717472626179521",587]
["1717472557167210",588]
["1717472650179616",589]
["1717472631179522",590]
["1717472519179270",591]
["171747330118287",592]
["1717472481179206",593]
["171747245251",594]
["1717472744179630",595]
["1717472790179635",596]
["1717472537122192",597]
["1717473200180366",598]
["1717472438179231",599]
["1717473002179934",600]
["1717472533179284",601]
["1717472512179250",602]
["1717472513179251",603]
["1717473182180331",604]
["171747255178193",605]
["1717472521128315",606]
["1717472623179523",607]
["1717472401179192",608]
["1717472453179759",609]
["1717472617132247",610]
["1717473056180101",611]
["171747266493333",612]
["1717473061180097",613]
["1717472791179617",614]
["1717472495179285",615]
["1717472820179805",616]
["1717472378145918",617]
["1717472456179332",618]
["171747250594963",619]
["1717472488123252",620]
["1717473442180874",621]
["1717472998179871",622]
["17174734419665",623]
["1717473438180858",624]
["1717473439180857",625]
["1717473393180797",626]
["171747344026323",627]
["1717472561122251",628]
["1717473210180294",629]
["1717473053161745",630]
["1717473305180517",631]
["1717472363179121",632]
["1717473894181295",633]
["171747256866334",634]
["1717472614122858",635]
["171747256211736",636]
["1717472852103402",637]
["1717473001146712",638]
["171747246260655",639]
["1717472534179268",640]
["1717472593179375",641]
["1717472632179500",642]
["1717472840179748",643]
["1717472925179793",644]
["171747252526823",645]
["1717472926179791",646]
["1717472879129971",647]
["171747341022537",648]
["171747325411374",649]
["1717472862179648",650]
["1717472666153223",651]
["1717473499180913",652]
["1717472350178910",653]
["1717472349178914",654]
["1717472826190905",655]
["1717472774121702",656]
["1717472893171991",657]
["1717472514179565",658]
["1717472957133715",659]
["1717473500180914",660]
["1717472900179811",661]
["1717472971116766",662]
["171747286311383",663]
["1717472901179855",664]
["1717472959123173",665]
["1717473271180403",666]
["1717472903170230",667]
["1717472630179520",668]
["1717472566142832",669]
["1717473024180344",670]
["1717473161180345",671]
["1717473164180353",672]
["1717473162180346",673]
["1717473163180347",674]
["1717473165180348",675]
["1717472872179730",676]
["1717472873179731",677]
["1717472874179732",678]
["171747287529015",679]
["1717472490123015",680]
["1717472919179815",681]
["1717472490124182",682]
["171747255812238",683]
["1717472635179501",684]
["1717473018179998",685]
["1717472603179510",686]
["171747260451176",687]
["171747302280021",688]
["171747264238023",689]
["1717472780179816",690]
["171747288127953",691]
["171747302746990",692]
["1717473226180349",693]
["1717472629179750",694]
["171747284629236",695]
["1717473794181387",696]
["171747311226872",697]
["1717473266180269",698]
["1717472807142788",699]
["1717472805179631",700]
["1717472654158534",701]
["1717472886166025",702]
["1717472887179795",703]
["1717473057180191",704]
["1717472917131288",705]
["1717472916179820",706]
["1717472837179626",707]
["171747301732887",708]
["1717472882156762",709]
["1717473069180351",710]
["1717472883179856",711]
["1717473047180098",712]
["1717472950145769",713]
["1717472918179797",714]
["1717473400180734",715]
["1717473385180735",716]
["171747310079714",717]
["1717473045180122",718]
["1717472795179632",719]
["1717473477180814",720]
["1717473576180915",721]
["1717472976179831",722]
["1717472969179801",723]
["1717472960/1717472968143122",724]
["1717472977179825",725]
["1717472930179826",726]
["171747287616432",727]
["1717472911179828",728]
["1717472839134576",729]
["1717472958179798",730]
["1717472975149938",731]
["1717472981179935",732]
["1717473192180404",733]
["171747316023630",734]
["171747293129250",735]
["1717472835144697",736]
["1717472849144750",737]
["1717472960/1717472968179789",738]
["1717472792179647",739]
["171747334239016",740]
["1717472804159248",741]
["1717473475180815",742]
["1717473015129016",743]
["1717473140167447",744]
["1717472940179832",745]
["1717472945/1717472946179542",746]
["1717472945/1717472946116165",747]
["1717473206123511",748]
["1717473461507",749]
["17174734601786",750]
["171747353831518",751]
["1717473078144508",752]
["1717472776179620",753]
["1717472921179833",754]
["1717472659179625",755]
["1717473109180311",756]
["1717472895142011",757]
["1717472822179850",758]
["1717473088180187",759]
["1717472982179838",760]
["1717472831179840",761]
["1717472853179842",762]
["1717472836179841",763]
["1717473478180816",764]
["171747321179261",765]
["1717473401134333",766]
["1717472951179847",767]
["1717472781179857",768]
["1717472983146397",769]
["1717472877179738",770]
["1717472999179790",771]
["1717472878120076",772]
["171747312717331",773]
["171747294113043",774]
["1717472964179852",775]
["1717472890179851",776]
["1717472889179845",777]
["1717473051180103",778]
["1717473142156745",779]
["1717472979179846",780]
["1717473405180742",781]
["1717473110180297",782]
["1717473284180477",783]
["1717472896116169",784]
["1717472934116159",785]
["1717473013155875",786]
["1717473458180916",787]
["1717473272180407",788]
["171747322310900",789]
["1717473064180146",790]
["171747315725057",791]
["1717473039180019",792]
["171747365639429",793]
["1717473256180478",794]
["1717473143180409",795]
["1717473126180354",796]
["1717473149180393",797]
["1717473030180040",798]
["1717473233180292",799]
["1717473071180099",800]
["1717473322180518",801]
["1717473535180961",802]
["1717473201180300",803]
["171747319759626",804]
["171747319816867",805]
["1717473084180410",806]
["1717473150170016",807]
["1717473306180519",808]
["1717473031155773",809]
["1717473128180442",810]
["1717473376180818",811]
["1717473247180414",812]
["1717473251180417",813]
["171747323228507",814]
["1717473058180188",815]
["171747374279161",816]
["17174736553827",817]
["1717473186180433",818]
["1717473370180647",819]
["1717473386180736",820]
["1717473398180693",821]
["1717473352105472",822]
["171747335380964",823]
["1717473334150052",824]
["1717474362182100",825]
["1717473252180305",826]
["1717473178164325",827]
["171747310315200",828]
["171747310211934",829]
["1717472994/1717472995/1717472996/1717473293/171747152113125",830]
["171747310626942",831]
["1717472994/1717472995/1717472996/1717473293/171747152117635",832]
["1717472994/1717472995/1717472996/1717473293/1717471521137136",833]
["171747385833957",834]
["1717473098180212",835]
["1717473377180692",836]
["1717473214180362",837]
["1717473072180207",838]
["171747331381877",839]
["1717473396180698",840]
["1717473236116216",841]
["1717473230155177",842]
["1717473259180426",843]
["1717473268180428",844]
["1717473739181187",845]
["1717473185180271",846]
["1717473365180648",847]
["1717473740181188",848]
["1717473592180918",849]
["1717473174180430",850]
["1717473111180395",851]
["1717473403155920",852]
["1717473218163080",853]
["1717473320169261",854]
["171747342831506",855]
["1717473221141679",856]
["1717473086180190",857]
["1717473291/1717473292/1717475746164125",858]
["1717473270164776",859]
["1717473269170426",860]
["1717473136180370",861]
["171747473219439",862]
["1717473567180959",863]
["1717473260180335",864]
["1717473074180147",865]
["1717473555150046",866]
["171747324014992",867]
["1717474077181583",868]
["171747363846463",869]
["1717473569180920",870]
["1717473568180921",871]
["1717473426180770",872]
["1717473532180748",873]
["1717473531180750",874]
["1717473242180440",875]
["1717473337180603",876]
["17174733369546",877]
["171747356290882",878]
["1717473479180811",879]
["1717473520137954",880]
["1717473361180649",881]
["1717473490159456",882]
["1717473609144975",883]
["1717473584180923",884]
["1717473664181415",885]
["17174736699578",886]
["171747366827370",887]
["1717473666158171",888]
["171747366721135",889]
["1717473318180695",890]
["1717473598180826",891]
["1717473545180903",892]
["1717473814153510",893]
["1717473563180909",894]
["1717473316180558",895]
["1717473491180964",896]
["171747332110373",897]
["171747350341825",898]
["171747350434308",899]
["1717473456145987",900]
["1717473492180910",901]
["1717473397144430",902]
["1717473359180645",903]
["1717473579149687",904]
["1717473763129789",905]
["1717473494143883",906]
["171747355760658",907]
["1717473558180926",908]
["171747339415237",909]
["1717473338152855",910]
["1717473893181328",911]
["1717473785181273",912]
["171747397420653",913]
["1717473421180752",914]
["1717473625132584",915]
["1717472994/1717472995/1717472996/1717473293/1717471521180206",916]
["1717473355180623",917]
["1717473369180705",918]
["1717473407180730",919]
["1717474376122386",920]
["171747354228219",921]
["1717473543180866",922]
["1717473471180867",923]
["171747367050777",924]
["1717473554180929",925]
["1717473553122252",926]
["1717473534122583",927]
["1717473533122584",928]
["1717473803142997",929]
["1717473495180904",930]
["1717473497180930",931]
["1717473496180931",932]
["1717473917181316",933]
["1717473747181146",934]
["1717473404132469",935]
["1717473432180729",936]
["1717473415180733",937]
["1717473416180731",938]
["1717473447180932",939]
["1717474058181519",940]
["1717474101181729",941]
["171747343590613",942]
["171747354860466",943]
["171747377299432",944]
["1717473565180810",945]
["1717473429180741",946]
["1717473399180813",947]
["1717473487180935",948]
["171747346898011",949]
["1717473767/1717474560143352",950]
["1717474374182184",951]
["1717473325143565",952]
["171747358132042",953]
["1717473767/1717474560162094",954]
["1717473767/1717474560146651",955]
["1717473767/1717474560181314",956]
["1717473767/1717474560181313",957]
["1717473767/1717474560772",958]
["1717473767/1717474560181315",959]
["1717473767/1717474560127086",960]
["1717473767/1717474560182268",961]
["1717473506129060",962]
["171747376496421",963]
["1717473776181189",964]
["1717473507180906",965]
["1717473536180965",966]
["1717473480122975",967]
["171747355160426",968]
["1717473511180941",969]
["1717473437180800",970]
["1717473702130139",971]
["1717473748181240",972]
["1717473749181232",973]
["1717473757181233",974]
["171747412115343",975]
["1717473606180908",976]
["171747351380657",977]
["1717473810181333",978]
["1717473673181210",979]
["1717473575180960",980]
["1717473537180829",981]
["1717473674181174",982]
["1717473515180948",983]
["1717473596180830",984]
["1717473621180981",985]
["171747433823332",986]
["1717473446131498",987]
["1717473525180953",988]
["1717473719181334",989]
["171747344434122",990]
["1717473489180773",991]
["1717473516180958",992]
["1717473634181082",993]
["1717473830181326",994]
["1717473831181336",995]
["1717473707181154",996]
["1717473519124882",997]
["171747355032794",998]
["171747380956991",999]
["1717473846181366",1000]
["1717474159181854",1001]
["1717474110116930",1002]
["1717473602181042",1003]
["1717473704181425",1004]
["1717473608181063",1005]
["1717473783181426",1006]
["1717473627180978",1007]
["1717473801134028",1008]
["1717473798181427",1009]
["1717474430182316",1010]
["1717473848152469",1011]
["1717473758181234",1012]
["1717473835181318",1013]
["1717473834181339",1014]
["1717473867181430",1015]
["1717473832181340",1016]
["1717473818181299",1017]
["1717473632181003",1018]
["1717473952181341",1019]
["1717474122181736",1020]
["1717473650181066",1021]
["1717474598128496",1022]
["1717473750123167",1023]
["1717473896181343",1024]
["1717473982110488",1025]
["171747397559764",1026]
["1717473744181292",1027]
["171747386679275",1028]
["1717473799128768",1029]
["1717473671181162",1030]
["1717474309182017",1031]
["171747375164657",1032]
["1717474029181431",1033]
["1717474028181443",1034]
["1717474092181654",1035]
["1717473804181320",1036]
["1717474522147102",1037]
["1717474268152844",1038]
["1717474629182587",1039]
["1717473716181019",1040]
["1717473600180902",1041]
["1717473600180893",1042]
["1717473600180896",1043]
["1717473600180894",1044]
["1717473600180895",1045]
["1717473600180901",1046]
["171747360099594",1047]
["1717473698181158",1048]
["1717473746158429",1049]
["1717473768121218",1050]
["1717473731181422",1051]
["1717473769121235",1052]
["1717474030181357",1053]
["1717474079181541",1054]
["1717473709132403",1055]
["1717473732181436",1056]
["1717474484182404",1057]
["1717474018181348",1058]
["1717473977169583",1059]
["1717473850181302",1060]
["171747408232029",1061]
["1717473657181159",1062]
["1717473658181148",1063]
["1717473659181160",1064]
["1717474032181437",1065]
["1717473813181361",1066]
["1717474096181665",1067]
["1717473902155433",1068]
["1717473901181439",1069]
["1717474001135216",1070]
["1717473790181363",1071]
["1717473980169746",1072]
["1717473837181370",1073]
["171747385339203",1074]
["171747409733076",1075]
["1717474098181728",1076]
["17174740999147",1077]
["1717473770181364",1078]
["1717473771181305",1079]
["1717474174181979",1080]
["1717473863181687",1081]
["1717474523150234",1082]
["1717473805181239",1083]
["1717473743181444",1084]
["1717473878181367",1085]
["171747372915397",1086]
["1717473854181368",1087]
["1717473888181447",1088]
["1717473879138761",1089]
["1717473936181307",1090]
["1717473784118002",1091]
["1717473756181260",1092]
["1717473717181212",1093]
["171747373730891",1094]
["1717473735181293",1095]
["171747381516791",1096]
["1717473726181374",1097]
["1717474063181545",1098]
["171747385713751",1099]
["171747398360619",1100]
["1717474083181666",1101]
["1717474080181587",1102]
["1717474017181626",1103]
["171747411147677",1104]
["1717474180105512",1105]
["1717474161181858",1106]
["171747421911720",1107]
["1717474256181861",1108]
["1717474593182461",1109]
["1717474093181707",1110]
["1717474085181686",1111]
["1717474151181812",1112]
["1717474059145143",1113]
["1717474060145143",1113]
["171747434113344",1114]
["1717474215107449",1115]
["171747418158513",1116]
["1717474351153329",1117]
["171747402225226",1118]
["1717474372128681",1119]
["1717474324182012",1120]
["1717474367182142",1121]
["171747424034885",1122]
["171747424137735",1123]
["171747424251663",1124]
["171747426184816",1125]
["1717473968181455",1126]
["1717474275181859",1127]
["1717474167163873",1128]
["1717474145167589",1129]
["1717473840181456",1130]
["171747458959719",1131]
["1717474636182627",1132]
["1717474039181582",1133]
["1717474163182004",1134]
["171747461839195",1135]
["1717474273181855",1136]
["1717474084181648",1137]
["1717474269172183",1138]
["1717474004181458",1139]
["171747426052765",1140]
["1717474555182505",1141]
["1717474136181672",1142]
["171747424841488",1143]
["1717473900172914",1144]
["1717474330168674",1145]
["1717473915181421",1146]
["1717474199182018",1147]
["1717474276181880",1148]
["1717474272181860",1149]
["1717474274181879",1150]
["1717474062181521",1151]
["1717474424182317",1152]
["1717474169145441",1153]
["1717474170145452",1154]
["1717474171181813",1155]
["1717474277131765",1156]
["171747430513154",1157]
["1717474299182003",1158]
["1717474306128045",1159]
["1717474315182023",1160]
["1717474323182024",1161]
["1717474187181815",1162]
["1717474188145453",1163]
["1717474186181814",1164]
["1717474300182025",1165]
["171747420132763",1166]
["1717474366182026",1167]
["1717474133128497",1168]
["1717474384136849",1169]
["1717474382136828",1170]
["1717474383136827",1171]
["1717474344136831",1172]
["1717474326182000",1173]
["1717474346136824",1174]
["1717474303182028",1175]
["1717474230181862",1176]
["1717474263182002",1177]
["1717474164181863",1178]
["1717474370182187",1179]
["1717474489182425",1180]
["171747446316562",1181]
["1717474526182463",1182]
["1717474148181792",1183]
["1717474138181791",1184]
["1717474206182001",1185]
["1717474149181793",1186]
["1717474451182333",1187]
["1717474139170906",1188]
["171747423947691",1189]
["1717474291181978",1190]
["1717474290158046",1191]
["1717474292145052",1192]
["1717474293105535",1193]
["171747435822381",1194]
["1717474150121129",1195]
["1717474719182844",1196]
["1717474154181821",1197]
["17174743163836",1198]
["1717474173149268",1199]
["1717474172181770",1200]
["1717474483182419",1201]
["1717474156181835",1202]
["1717474594182464",1203]
["171747472095015",1204]
["1717474294181972",1205]
["171747423485535",1206]
["171747424947045",1207]
["171747453718216",1208]
["1717474281181974",1209]
["171747428256982",1210]
["1717474235181975",1211]
["1717474403182466",1212]
["1717474597115171",1213]
["1717474510182441",1214]
["171747446578994",1215]
["1717474630182589",1216]
["1717474321181876",1217]
["1717474632182690",1218]
["1717474322181877",1219]
["17174745382211",1220]
["1717474545182427",1221]
["1717474600182521",1222]
["1717474634182565",1223]
["1717474385140733",1224]
["1717474757182935",1225]
["17174744351669",1226]
["1717474427182294",1227]
["1717474356182057",1228]
["1717474380182206",1229]
["1717474495182353",1230]
["1717474578182458",1231]
["1717474412172177",1232]
["1717474756124029",1233]
["1717474575159725",1234]
["1717474588116100",1235]
["171747441933285",1236]
["1717474434107935",1237]
["1717474405182248",1238]
["1717474410182186",1239]
["1717474393182291",1240]
["17174751232967",1241]
["1717474445182478",1242]
["1717474400182315",1243]
["1717474905183364",1244]
["1717474406182312",1245]
["1717474557182430",1246]
["1717474585182506",1247]
["1717474444182501",1248]
["1717474631182606",1249]
["1717474554182504",1250]
["1717474417182320",1251]
["171747441626465",1252]
["1717474544145144",1253]
["1717474472182379",1254]
["1717474486182375",1255]
["1717474675109596",1256]
["171747467781362",1257]
["1717474534182321",1258]
["1717474580152002",1259]
["171747479460676",1260]
["1717474721182817",1261]
["1717474414182297",1262]
["1717474579182459",1263]
["1717474514165963",1264]
["1717474573163525",1265]
["1717474546143211",1266]
["1717474591182460",1267]
["1717474801182889",1268]
["1717474678182754",1269]
["1717474539182435",1270]
["1717474549148141",1271]
["1717474475182422",1272]
["171747447416525",1273]
["1717474570182421",1274]
["17174745502038",1275]
["1717474442182298",1276]
["1717474552121196",1277]
["1717474553108810",1278]
["1717474530123830",1279]
["1717474657182695",1280]
["1717474532135755",1281]
["171747458131216",1282]
["1717474508182437",1283]
["1717474459143621",1284]
["1717474541182438",1285]
["171747521324949",1286]
["1717474809182891",1287]
["1717474582130057",1288]
["1717474576182492",1289]
["1717474604165535",1290]
["1717474605165536",1291]
["1717474513182496",1292]
["1717474655182712",1293]
["1717474536182498",1294]
["1717474500182373",1295]
["171747478632034",1296]
["1717475189183659",1297]
["1717475060183399",1298]
["1717474991183376",1299]
["1717474764182818",1300]
["1717474722182847",1301]
["171747496930419",1302]
["171747482337716",1303]
["1717474782182841",1304]
["171747481068060",1305]
["1717474695182740",1306]
["1717474754182898",1307]
["1717474805182882",1308]
["1717474777182899",1309]
["1717474626182900",1310]
["1717474609182543",1311]
["1717474676121826",1312]
["1717474787182849",1313]
["1717475036183455",1314]
["1717474856183068",1315]
["1717474740138482",1316]
["1717474792153591",1317]
["1717474806182904",1318]
["1717474780182906",1319]
["1717474789182907",1320]
["171747475132290",1321]
["1717475124183599",1322]
["1717474672135061",1323]
["1717474933818",1324]
["171747474525676",1325]
["1717474771182842",1326]
["171747500625143",1327]
["1717475007116848",1328]
["1717474699182885",1329]
["1717474669/1717475487152845",1330]
["1717474669/1717475487152846",1331]
["1717474617182911",1332]
["1717474627153229",1333]
["1717474640134748",1334]
["1717474881183215",1335]
["1717474886183222",1336]
["1717474887147101",1337]
["1717474882139716",1338]
["1717474906183217",1339]
["171747488895026",1340]
["1717474942183415",1341]
["17174748839921",1342]
["1717475334183806",1343]
["1717474649182670",1344]
["1717474772127654",1345]
["1717474922183257",1346]
["1717474791182913",1347]
["1717474910183236",1348]
["171747465345650",1349]
["1717474821182917",1350]
["1717474868183176",1351]
["1717474753182855",1352]
["1717474705108886",1353]
["171747467359399",1354]
["1717474775182915",1355]
["171747488426581",1356]
["1717474671182918",1357]
["1717474738182840",1358]
["1717474758182879",1359]
["1717474724182932",1360]
["1717474763182923",1361]
["1717474850183088",1362]
["1717474917183277",1363]
["171747501038317",1364]
["1717474914153506",1365]
["171747493470827",1366]
["1717475329183845",1367]
["1717474948183340",1368]
["171747475941448",1369]
["171747481731181",1370]
["1717474815182884",1371]
["1717474860170019",1372]
["17174749609869",1373]
["171747492022117",1374]
["1717474825182927",1375]
["1717474808182928",1376]
["1717474713182938",1377]
["1717474818172663",1378]
["1717475205183678",1379]
["1717475206183677",1380]
["1717475207183679",1381]
["1717475235148807",1382]
["171747503914565",1383]
["1717475335183807",1384]
["1717475336183808",1385]
["171747543160050",1386]
["1717474797182930",1387]
["1717474867183152",1388]
["17174748741208",1389]
["1717475040183387",1390]
["1717475021153862",1391]
["171747513320147",1392]
["1717475070183431",1393]
["1717475031183402",1394]
["1717475026183416",1395]
["1717475163163705",1396]
["1717475022183445",1397]
["1717475096183506",1398]
["1717475041130701",1399]
["1717475042183450",1400]
["1717471437/1717471438/1717474980183172",1401]
["171747484437636",1402]
["1717475043183447",1403]
["1717475027183372",1404]
["1717474950183420",1405]
["1717474940108059",1406]
["171747494916119",1407]
["171747507466866",1408]
["1717474979183407",1409]
["1717474986183451",1410]
["1717474967183348",1411]
["1717474966183347",1412]
["171747494327875",1413]
["1717474957183369",1414]
["1717475478184205",1415]
["1717474958183342",1416]
["1717474925183299",1417]
["1717474657182696",1418]
["1717475269183742",1419]
["171747486681183",1420]
["1717474951158941",1421]
["1717475046183426",1422]
["1717475167128745",1423]
["1717475047183448",1424]
["1717475048183427",1425]
["171747516810471",1426]
["1717474999183428",1427]
["1717474988145178",1428]
["1717474973183410",1429]
["1717475245183784",1430]
["171747518628943",1431]
["1717474908143631",1432]
["1717475131155712",1433]
["1717474927183344",1434]
["1717475051120827",1435]
["171747505331361",1436]
["1717475052183433",1437]
["1717475054183434",1438]
["1717475098183432",1439]
["1717475091183392",1440]
["1717475221163350",1441]
["1717475222154893",1442]
["1717474998144049",1443]
["171747520832002",1444]
["171747502960788",1445]
["1717475032183435",1446]
["1717475116183634",1447]
["1717474954114624",1448]
["1717474970183436",1449]
["1717474944183403",1450]
["1717475003183437",1451]
["1717475236183744",1452]
["171747500260561",1453]
["1717475001183453",1454]
["1717474947183404",1455]
["171747500960552",1456]
["1717475145183635",1457]
["1717475044183406",1458]
["1717475200183751",1459]
["1717475191183761",1460]
["1717474989175282",1461]
["1717474981175284",1462]
["1717475169183662",1463]
["1717475013183395",1464]
["1717475184183699",1465]
["1717474919104798",1466]
["171747504514781",1467]
["1717475018183396",1468]
["1717475075120266",1469]
["171747520148090",1470]
["1717475554184328",1471]
["1717475059183370",1472]
["1717475066183397",1473]
["1717475076131492",1474]
["1717475291163688",1475]
["1717475012135173",1476]
["1717475549184367",1477]
["1717475216172316",1478]
["171747521798016",1479]
["171747512149485",1480]
["1717475266147695",1481]
["171747522528929",1482]
["1717475226171617",1483]
["171747514761076",1484]
["1717475277183811",1485]
["17174756403834",1486]
["1717475298154202",1487]
["1717475142183813",1488]
["1717475114183571",1489]
["1717475387103354",1490]
["171747538031566",1491]
["1717475369183912",1492]
["1717475309183859",1493]
["1717475384183971",1494]
["171747537841146",1495]
["1717475111183597",1496]
["1717475113183591",1497]
["1717475112183598",1498]
["1717475550184336",1499]
["171747524817255",1500]
["1717475320183875",1501]
["1717475193172123",1502]
["1717475107173376",1503]
["1717475338183870",1504]
["1717475106183530",1505]
["1717475196183873",1506]
["1717475155183703",1507]
["171747520362209",1508]
["1717475352183871",1509]
["1717475299183830",1510]
["1717475180183745",1511]
["1717475339183909",1512]
["171747546426507",1513]
["171747535657678",1514]
["1717475228154228",1515]
["1717475486184246",1516]
["1717475313183818",1517]
["171747527222745",1518]
["1717475482184225",1519]
["1717475330183803",1520]
["1717475396167656",1521]
["1717475267144947",1522]
["171747557229415",1523]
["1717475353183876",1524]
["171747557122752",1525]
["171747541060668",1526]
["1717475223183766",1527]
["1717475249175771",1528]
["1717475411184102",1529]
["1717475250175770",1530]
["171747531538624",1531]
["1717475256183787",1532]
["1717475257183782",1533]
["1717475264141581",1534]
["1717475625165337",1535]
["1717475340183879",1536]
["1717475533184379",1537]
["1717475212161142",1538]
["1717475321183890",1539]
["171747553437999",1540]
["1717475372183881",1541]
["1717475654184289",1542]
["1717475479184226",1543]
["1717475530184296",1544]
["1717475341183822",1545]
["1717475326183846",1546]
["1717475308183823",1547]
["1717475307183828",1548]
["1717475238183791",1549]
["1717475406166134",1550]
["1717475331183910",1551]
["1717475214168249",1552]
["1717475276128605",1553]
["1717475322183885",1554]
["171747535532118",1555]
["1717475323183847",1556]
["171747566241345",1557]
["171747566346916",1558]
["1717475674141904",1559]
["1717475324183886",1560]
["171747527913554",1561]
["171747530224987",1562]
["1717475465167998",1563]
["1717475576184338",1564]
["171747549525065",1565]
["1717475436184103",1566]
["1717475258183825",1567]
["1717475518184298",1568]
["1717475519184299",1569]
["1717475525184300",1570]
["1717475526150127",1571]
["1717475527184301",1572]
["171747552812810",1573]
["1717475539142818",1574]
["1717475630132731",1575]
["1717475641184375",1576]
["1717475646184343",1577]
["1717475647184344",1578]
["171747552122021",1579]
["171747555521994",1580]
["1717475636108732",1581]
["1717475605184329",1582]
["1717475444184345",1583]
["1717475452184346",1584]
["1717475511154083",1585]
["1717475547102710",1586]
["1717475445184380",1587]
["1717475648184349",1588]
["171747556783859",1589]
["1717475626184350",1590]
["1717474669/1717475487184055",1591]
["1717474669/1717475487184056",1592]
["1717475627184244",1593]
["1717475433151887",1594]
["1717475668184275",1595]
["1717475392184057",1596]
["1717475557132925",1597]
["1717475475184215",1598]
["1717475631184357",1599]
["1717475676130854",1600]
["1717475470184210",1601]
["1717475471184211",1602]
["1717475472184214",1603]
["1717475490184212",1604]
["1717475494176363",1605]
["1717475679106413",1606]
["1717475485184309",1607]
["1717475558184332",1608]
["1717475575184327",1609]
["1717475420166082",1610]
["1717475616184361",1611]
["1717475677184363",1612]
["1717475612184245",1613]
["1717475502125151",1614]
["1717475624184321",1615]
["1717475546184365",1616]
["1717475613184250",1617]
["1717475562184366",1618]
["171747563439081",1619]
["1717475510184323",1620]
["1717475564184370",1621]
["1717475573184223",1622]
["1717469033173668",1623]
["1717470528175834",1624]
["1717472009178433",1625]
["1717472447179163",1626]
["1717472480179327",1627]
["1717472571179287",1628]
["1717467514171001",1629]
["171747605619259",1630]
["171747663721773",1631]
["1717472171148100",1632]
["1717475955184843",1633]
["1717475990184853",1634]
["1717469885174930",1635]
["1717475882184877",1636]
["1717476064185080",1637]
["171747629461871",1638]
["1717476240185403",1639]
["1717476468185762",1640]
["1717472446179164",1641]
["1717470595175926",1642]
["1717472653179524",1643]
["1717473891181330",1644]
["1717476208185313",1645]
["1717466993169876",1646]
["1717469799175367",1647]
["1717476296185413",1648]
["1717467739171475",1649]
["1717475760184727",1650]
["1717476298151257",1651]
["1717476134153348",1652]
["171747651758922",1653]
["1717472586171461",1654]
["1717470381175786",1655]
["1717475917159056",1656]
["1717476117185184",1657]
["1717476047184957",1658]
["1717476248185407",1659]
["1717476694185948",1660]
["1717472484179317",1661]
["1717470281175521",1662]
["1717476558185938",1663]
["1717476506185791",1664]
["1717476591185855",1665]
["1717475117183594",1666]
["171747622827585",1667]
["1717470067175229",1668]
["1717471277177145",1669]
["1717470683176149",1670]
["1717473291/1717473292/1717475746184473",1671]
["1717475801184672",1672]
["1717475827184804",1673]
["1717471853178256",1674]
["1717476035185015",1675]
["1717475722184539",1676]
["1717471247177117",1677]
["1717476218185311",1678]
["1717476452185625",1679]
["1717471209177364",1680]
["1717476104185122",1681]
["1717476230185434",1682]
["171747124613007",1683]
["171747620764473",1684]
["1717476054185079",1685]
["1717475754184778",1686]
["1717472263178695",1687]
["171747668868786",1688]
["1717476539185843",1689]
["1717476415185541",1690]
["1717470577175917",1691]
["1717476205185312",1692]
["1717472004178694",1693]
["1717471915178258",1694]
["1717476730/1717476731/171747694137695",1695]
["1717470618176045",1696]
["1717476341185519",1697]
["1717471604177858",1698]
["1717470641176025",1699]
["1717476014184910",1700]
["1717473036165344",1701]
["1717471586177787",1702]
["171747593527161",1703]
["1717472474179216",1704]
["1717469900174971",1705]
["1717472103178589",1706]
["1717471978178369",1707]
["1717476459185678",1708]
["1717472854179843",1709]
["1717468836173654",1710]
["171747641922640",1711]
["1717476162146808",1712]
["171747623660572",1713]
["1717471094176767",1714]
["1717475811184684",1715]
["1717475737184686",1716]
["1717476377185446",1717]
["1717476548185775",1718]
["1717476519185985",1719]
["171747654137723",1720]
["1717472609179504",1721]
["1717475769184707",1722]
["1717476673185967",1723]
["1717476431185626",1724]
["171747614220768",1725]
["1717476561185900",1726]
["1717470243175387",1727]
["1717469991175202",1728]
["1717470364175589",1729]
["1717468847173623",1730]
["1717475944184845",1731]
["1717476513153406",1732]
["1717475926184763",1733]
["171747661427543",1734]
["1717475738171433",1735]
["1717476583185874",1736]
["1717473220180308",1737]
["1717475698184561",1738]
["17174764993313",1739]
["1717475934124843",1740]
["1717476112185123",1741]
["1717476133150364",1742]
["1717470203175356",1743]
["1717476579153441",1744]
["171747646679135",1745]
["1717476534160588",1746]
["1717470559175900",1747]
["171747582197692",1748]
["1717471969178349",1749]
["1717476627162564",1750]
["1717476234123892",1751]
["171747606758624",1752]
["1717470690176172",1753]
["1717470864176357",1754]
["1717476396185518",1755]
["1717471990178803",1756]
["1717470459175624",1757]
["1717474075181647",1758]
["1717464745166020",1759]
["1717475992141491",1760]
["1717476426185560",1761]
["1717471567177818",1762]
["1717469080173872",1763]
["17174765499887",1764]
["1717476456185749",1765]
["1717476476185672",1766]
["1717473108173424",1767]
["1717476544153413",1768]
["1717472056178566",1769]
["1717476693185912",1770]
["1717476543153410",1771]
["1717471763178139",1772]
["1717475885184750",1773]
["1717476182185339",1774]
["1717476249103775",1775]
["1717476691151570",1776]
["1717476154185226",1777]
["1717474238182078",1778]
["1717476197185337",1779]
["171747669038488",1780]
["1717471838178304",1781]
["1717471220177097",1782]
["1717476183153054",1783]
["1717472084178775",1784]
["1717471129176851",1785]
["1717472425179321",1786]
["1717471463177817",1787]
["1717476215129507",1788]
["1717476096185124",1789]
["1717476235185360",1790]
["1717468539172856",1791]
["1717476680131933",1792]
["1717476496185753",1793]
["1717472645179629",1794]
["1717475908146814",1795]
["171747609430606",1796]
["1717472766179768",1797]
["1717475733184685",1798]
["1717475702184560",1799]
["1717469534174476",1800]
["1717476265185288",1801]
["1717476376185308",1802]
["1717475729184621",1803]
["1717471937178265",1804]
["1717472616179477",1805]
["171747589248274",1806]
["171617392214883",1807]
["1717470108175245",1808]
["1717467995171994",1809]
["1717475878128102",1810]
["1717471849151285",1811]
["1717472007148806",1812]
["1717472245178787",1813]
["1717476631158827",1814]
["1717470914176422",1815]
["1717476397185453",1816]
["1717471698177912",1817]
["1717475903184811",1818]
["171747578830916",1819]
["1717476223156337",1820]
["1717475692184565",1821]
["1717467942171961",1822]
["1717476062129759",1823]
["1717475202183810",1824]
["1717476275185463",1825]
["1717476156185228",1826]
["1717476514185793",1827]
["1717475765184852",1828]
["1717476435185675",1829]
["1717466573169121",1830]
["1717475914146313",1831]
["1717470436175891",1832]
["1717475957184844",1833]
["1717476388185542",1834]
["1717474648182777",1835]
["1717475946184754",1836]
["1717476201185277",1837]
["1717471792178294",1838]
["1717476217185318",1839]
["1717476098185429",1840]
["1717476260185412",1841]
["1717472441179143",1842]
["1717468556172874",1843]
["1717473806181261",1844]
["1717468344172397",1845]
["1717476194185350",1846]
["1717469856174956",1847]
["171747614411358",1848]
["171747025892403",1849]
["171747609234341",1850]
["1717472230178703",1851]
["1717475233183681",1852]
["1717475915184797",1853]
["1717475950172227",1854]
["1717475864184770",1855]
["1717470536175893",1856]
["1717472430179273",1857]
["1717475730165245",1858]
["1717476220185438",1859]
["1717469992174990",1860]
["171747608830883",1861]
["1717476232185353",1862]
["1717464100164851",1863]
["1717466293168668",1864]
["1717472180178754",1865]
["1717475237183880",1866]
["1717475715184559",1867]
["1717476300168312",1868]
["1717471488177864",1869]
["1717473933181383",1870]
["1717475714184563",1871]
["1717476004131080",1872]
["1717471670177868",1873]
["171747206568873",1874]
["1717475985184884",1875]
["1717470179175328",1876]
["1717470911176339",1877]
["1717470668151734",1878]
["1717476508153411",1879]
["1717472026159545",1880]
["1717467515170949",1881]
["1717476204140855",1882]
["1717475761143441",1883]
["1717476572185928",1884]
["1717476659147512",1885]
["171747298622487",1886]
["1717469014152669",1887]
["1717476643145927",1888]
["1717476163185183",1889]
["1717469213174040",1890]
["17174765623838",1891]
["1717473610181329",1892]
["1717471791178118",1893]
["1717476099185125",1894]
["1717476239103776",1895]
["171747596379876",1896]
["1717469097173873",1897]
["1717462384162092",1898]
["1717476442185645",1899]
["1717470251175458",1900]
["1717473493180825",1901]
["1717471568177788",1902]
["1717475681184431",1903]
["171747641321793",1904]
["1717476730/1717476731/1717476941110485",1905]
["1717469875174931",1906]
["1717471775127094",1907]
["1717476485185942",1908]
["1717470884176394",1909]
["1717475798184647",1910]
["1717467941171981",1911]
["1717473184180312",1912]
["1717472393179115",1913]
["1717476284185378",1914]
["1717476039184831",1915]
["1717472634179762",1916]
["171747223925198",1917]
["1717476241185338",1918]
["1717476103185126",1919]
["1717472114178706",1920]
["1717470856176339",1921]
["1717476246185389",1922]
["171747620613283",1923]
["1717476551185777",1924]
["171747659739064",1925]
["1717467402170758",1926]
["1717476290185480",1927]
["1717459681156570",1928]
["171747617064348",1929]
["1717473204180332",1930]
["1717475953184911",1931]
["1717471696177904",1932]
["1717473455180942",1933]
["1717471822149792",1934]
["1717476665185839",1935]
["1717471523177704",1936]
["1717468250172496",1937]
["171747586247275",1938]
["1717475922184815",1939]
["171747596679753",1940]
["1717476266185289",1941]
["1717472368179119",1942]
["1717465386167059",1943]
["1717458208154276",1944]
["1717471648177855",1945]
["1717472339178974",1946]
["1717472433179318",1947]
["1717476102185121",1948]
["171747596579754",1949]
["1717472177178692",1950]
["1717476367185451",1951]
["1717472403179184",1952]
["1717476523185771",1953]
["1717476354185460",1954]
["1717473587180945",1955]
["1717470370175582",1956]
["1717476491185815",1957]
["1717476157185099",1958]
["1717472241178759",1959]
["1717470573175915",1960]
["1717476116185169",1961]
["1717476115163009",1962]
["1717475951184842",1963]
["1717476146131744",1964]
["1717476360185384",1965]
["171747620218144",1966]
["1717476467185758",1967]
["1717475785142911",1968]
["1717471490177654",1969]
["1717475932174279",1970]
["171747640526025",1971]
["1717469631174695",1972]
["1717472618179502",1973]
["171747621135901",1974]
["1717476222162494",1975]
["1717475920184860",1976]
["171747634218425",1977]
["1717476576159828",1978]
["1717470227175372",1979]
["1717475685184478",1980]
["1717476330156139",1981]
["1717468242172333",1982]
["1717475680158533",1983]
["1717475690184546",1984]
["1717468873173567",1985]
["1717476581118828",1986]
["1717472844179734",1987]
["1717476483185901",1988]
["1717467991171908",1989]
["171747574060369",1990]
["1717475639184389",1991]
["171747575241742",1992]
["1717475701184564",1993]
["1717475736158970",1994]
["1717474329181521",1995]
["1717468482172881",1996]
["171747669278001",1997]
["1717476493153327",1998]
["1717475743184600",1999]
["171747656811387",2000]
["1717469840174887",2001]
["1717475910184799",2002]
["1717476302185375",2003]
["1717476469185710",2004]
["1717476599157541",2005]
["1717476026184932",2006]
["1717476559185965",2007]
["171747250721737",2008]
["1717475972123962",2009]
["1717476566159698",2010]
["1717476264185278",2011]
["1717457027152792",2012]
["171747660370954",2013]
["1717476322185358",2014]
["1717470141175228",2015]
["1717471716177992",2016]
["1717475659184317",2017]
["1717476358185330",2018]
["171747657738721",2019]
["171747146025320",2020]
["1717471652177914",2021]
["1717475911169092",2022]
["1717470225175370",2023]
["1717470469175779",2024]
["1717476593143900",2025]
["1717473886181346",2026]
["1717475890184654",2027]
["1717471651177853",2028]
["1717470167149247",2029]
["1717476049185081",2030]
["1717471580177810",2031]
["1717471885178305",2032]
["1717476160185216",2033]
["1717466700169369",2034]
["1717473244180337",2035]
["1717475869184777",2036]
["1717476229185352",2037]
["1717471854178296",2038]
["1717470174175366",2039]
["1717475870184755",2040]
["1717475901184756",2041]
["1717476145103887",2042]
["1717470209166621",2043]
["1717471187176960",2044]
["1717472012178478",2045]
["1717470712176257",2046]
["171747596132319",2047]
["1717467937171870",2048]
["1717472242178806",2049]
["1717476481185924",2050]
["1717471846178202",2051]
["171747609329571",2052]
["1717470653176026",2053]
["1717473007179936",2054]
["1717476679185846",2055]
["1717470447175791",2056]
["171747630181573",2057]
["1717468575172876",2058]
["1717470226175353",2059]
["1716636134150508",2060]
["1717470374175781",2061]
["1717471181176926",2062]
["1717475938184781",2063]
["1717473366180622",2064]
["1717476480185903",2065]
["1717476189171573",2066]
["1717471642177828",2067]
["1717476641177165",2068]
["1717471063176729",2069]
["1717475767184798",2070]
["1717470434175623",2071]
["1717469394174165",2072]
["1717476091109135",2073]
["1717476571141880",2074]
["1717471671177862",2075]
["1717476584185857",2076]
["1717471968178412",2077]
["1717475782184646",2078]
["1717470568175961",2079]
["1717472912179802",2080]
["1717476359185423",2081]
["1717471697177911",2082]
["1717476149185293",2083]
["1717470228175373",2084]
["1717471276177143",2085]
["1717472605179373",2086]
["1717470224175371",2087]
["1717472841179753",2088]
["1717467762171453",2089]
["171747623110896",2090]
["1717475753184669",2091]
["1717469878174932",2092]
["171747578121790",2093]
["1717476070150795",2094]
["1717472226178690",2095]
["1717472211178776",2096]
["1717472094162091",2097]
["1717470204175374",2098]
["1717471761178099",2099]
["1717475868184956",2100]
["1717471080176831",2101]
["1717475921130802",2102]
["171747596479877",2103]
["1717476649185860",2104]
["1717475806184663",2105]
["1717476644131352",2106]
["1717467965171918",2107]
["1717475797184664",2108]
["171747599511298",2109]
["171747651890363",2110]
["1717475927141448",2111]
["1717475755131764",2112]
["1717471971178313",2113]
["1717474864183374",2114]
["1717476121185374",2115]
["1717475991184814",2116]
["171747635323022",2117]
["1717475923173057",2118]
["1717475819172963",2119]
["1717476565185975",2120]
["1717470086175203",2121]
["1717472095178586",2122]
["1717471618177878",2123]
["1717468742173254",2124]
["1717472910179813",2125]
["1717474928183393",2126]
["1717476370185520",2127]
["1717473862157919",2128]
["1717476213185284",2129]
["171747590419870",2130]
["171747652631381",2131]
["1717476374185424",2132]
["171747595858607",2133]
["1717471820178187",2134]
["1717476254185373",2135]
["1717476373130451",2136]
["1717466701169370",2137]
["1717472370179037",2138]
["1717473522180924",2139]
["1717476512153407",2140]
["1717476212185421",2141]
["1717471051176804",2142]
["171747167646496",2143]
["1717470651169615",2144]
["1717475775184648",2145]
["1717472321178890",2146]
["171747619560790",2147]
["1717476594185919",2148]
["1717468322172388",2149]
["1717474183181963",2150]
["171747594960356",2151]
["1717468997173610",2152]
["1717476289185354",2153]
["1717461305159568",2154]
["1717475960184846",2155]
["1717474968183443",2156]
["1717470657176004",2157]
["1717475726184581",2158]
["1717476169185279",2159]
["1717468012171976",2160]
["1717470255175528",2161]
["1717476676174686",2162]
["1717476335185332",2163]
["1717476214185229",2164]
["1717475393183993",2165]
["171747579414947",2166]
["1717472181178788",2167]
["1717471398177357",2168]
["171747578324345",2169]
["1717471711152965",2170]
["1717476075151393",2171]
["1717475959115003",2172]
["1717471000176833",2173]
["1717476567185979",2174]
["1717476699185907",2175]
["1717476724186069",2176]
["1717476733186059",2177]
["1717476734186085",2178]
["1717476743186103",2179]
["1717476744186102",2180]
["1717476745186062",2181]
["1717476746186067",2182]
["1717476747186061",2183]
["1717476790186251",2184]
["1717476793186478",2185]
["171747679838278",2186]
["1717476800186294",2187]
["1717476802123149",2188]
["1717476807186234",2189]
["171747681378787",2190]
["1717476816186340",2191]
["1717476819186293",2192]
["1717476829157285",2193]
["171747683432324",2194]
["171747683533290",2195]
["1717476837186335",2196]
["1717476838186337",2197]
["1717476840137201",2198]
["1717476842186275",2199]
["1717476843186280",2200]
["171747684746482",2201]
["1717476852186336",2202]
["171747685460513",2203]
["1717476860132459",2204]
["1717476862186486",2205]
["171747687011960",2206]
["1717476871186375",2207]
["1717476873148708",2208]
["1717476874165261",2209]
["1717476879186274",2210]
["1717476890186451",2211]
["1717476892186341",2212]
["1717476897124645",2213]
["1717476899186379",2214]
["171747690711359",2215]
["1717476918186382",2216]
["1717476919186464",2217]
["1717476920132460",2218]
["1717476925156615",2219]
["1717476927186357",2220]
["171747693731755",2221]
["171747693925580",2222]
["1717476952158536",2223]
["1717476960186514",2224]
["1717476961166137",2225]
["1717476962186487",2226]
["171747696330954",2227]
["1717476965186384",2228]
["1717476966104650",2229]
["1717476967186386",2230]
["1717476968121045",2231]
["1717476971186513",2232]
["171747697479881",2233]
["1717476975156300",2234]
["1717476978143693",2235]
["171747697977620",2236]
["1717476980186493",2237]
["1717476982186559",2238]
["1717476983186431",2239]
["1717476984146592",2240]
["171747698720495",2241]
["1717476992186497",2242]
["1717476994186560",2243]
["1717476996186581",2244]
["1717476998134158",2245]
["1717477002186461",2246]
["1717477005186496",2247]
["1717477016186583",2248]
["1717477017186467",2249]
["1717477022186463",2250]
["1717477024186466",2251]
["1717477025186483",2252]
["1717477028186469",2253]
["1717477033186490",2254]
["171747704495983",2255]
["1717477062186711",2256]
["1717477066186688",2257]
["1717477074186624",2258]
["1717477077186753",2259]
["1717477079186666",2260]
["1717477084186754",2261]
["1717477097116354",2262]
["1717477104149491",2263]
["1717477123186794",2264]
["1717477129186751",2265]
["1717477132186818",2266]
["1717477133186819",2267]
["1717477134186823",2268]
["1717477138133269",2269]
["171747713940816",2270]
["171747714411290",2271]
["1717477146186938",2272]
["1717477156186817",2273]
["171747716224145",2274]
["1717477163186857",2275]
["1717477164167128",2276]
["1717477165186885",2277]
["1717477167123670",2278]
["1717477169186971",2279]
["171747717676224",2280]
["1717477177147240",2281]
["1717477178153446",2282]
["1717477182186895",2283]
["1717477188186949",2284]
["1717477191174278",2285]
["1717477194186943",2286]
["1717477195186897",2287]
["1717477198186837",2288]
["1717477199186894",2289]
["171747720046415",2290]
["1717477209128730",2291]
["1717477210186842",2292]
["1717477213131644",2293]
["1717477214131641",2294]
["1717477215186886",2295]
["1717477216131642",2296]
["1717477217131643",2297]
["171747722057783",2298]
["1717477221186839",2299]
["1717477223186902",2300]
["1717477226186947",2301]
["1717477228133716",2302]
["1717477235148026",2303]
["171747723618381",2304]
["1717477239135038",2305]
["1717477240186917",2306]
["1717477241186979",2307]
["171747724721969",2308]
["171747724927211",2309]
["171747725131611",2310]
["1717477254164853",2311]
["1717477255186923",2312]
["1717477258186864",2313]
["171747726026603",2314]
["1717477262186905",2315]
["1717477267186893",2316]
["1717477270186957",2317]
["1717477271186899",2318]
["1717477281126837",2319]
["171747730033035",2320]
["1717477302186920",2321]
["1717477304186980",2322]
["171747730726973",2323]
["1717477309186922",2324]
["1717477310167635",2325]
["1717477313186918",2326]
["1717477314186939",2327]
["171747731642311",2328]
["1717477322186954",2329]
["1717477324151860",2330]
["1717477327139743",2331]
["1717477328186951",2332]
["1717477331186919",2333]
["1717477333186962",2334]
["1717477334169989",2335]
["1717477335186977",2336]
["1717477336186965",2337]
["1717477337157353",2338]
["1717477338186933",2339]
["1717477348154577",2340]
["1717477349186936",2341]
["1717477350186834",2342]
["1717477351186883",2343]
["171747735411597",2344]
["171747735828492",2345]
["17174773593828",2346]
["171747736238206",2347]
["171747736591458",2348]
["171747737223691",2349]
["1717477375188076",2350]
["1717477377188089",2351]
["1717477378162760",2352]
["1717477383188101",2353]
["1717477387168844",2354]
["1717477388178118",2355]
["1717477390114390",2356]
["1717477391188088",2357]
["1717477393188093",2358]
["171747739827905",2359]
["1717477403188086",2360]
["1717477411135336",2361]
["1717477416188107",2362]
["1717477423188095",2363]
["1717477436175891",2364]
["1717477438188237",2365]
["1717477442188138",2366]
["1717477457172983",2367]
["1717477458169616",2368]
["1717477459188293",2369]
["1717477461165250",2370]
["1717477464159011",2371]
["1717477468188298",2372]
["1717477469188229",2373]
["1717477471160768",2374]
["1717477472125710",2375]
["1717477494188125",2376]
["1717477495188256",2377]
["1717477496188150",2378]
["1717477500145775",2379]
["1717477503188215",2380]
["171747750459245",2381]
["171747751427849",2382]
["1717477520188234",2383]
["1717477522188204",2384]
["1717477526188196",2385]
["171747753262799",2386]
["1717477533126312",2387]
["1717477537188230",2388]
["1717477542188197",2389]
["1717477545188152",2390]
["1717477546188165",2391]
["1717477547188158",2392]
["1717477548188162",2393]
["1717477556188214",2394]
["1717477558188199",2395]
["1717477572114207",2396]
["1717477574188175",2397]
["1717477589188190",2398]
["1717477602188120",2399]
["171747760631014",2400]
["171747760732076",2401]
["171747760832057",2402]
["1717477610188121",2403]
["1717477618188252",2404]
["1717477619188242",2405]
["1717477623188239",2406]
["1717477624188228",2407]
["1717477625188251",2408]
["171747762662856",2409]
["1717477627188277",2410]
["171747762841761",2411]
["1717477634141570",2412]
["171747763610160",2413]
["1717477638105834",2414]
["1717477639163373",2415]
["1717477641158449",2416]
["1717477642188140",2417]
["1717477643188137",2418]
["171747764729399",2419]
["1717477653188780",2420]
["1717477660123812",2421]
["1717477661161627",2422]
["1717477666188225",2423]
["1717477667188156",2424]
["1717477668146842",2425]
["1717477669113912",2426]
["1717477671188187",2427]
["1717477673188302",2428]
["171747768462410",2429]
["1717477687188224",2430]
["1717477691147390",2431]
["1717477694188213",2432]
["1717477703188243",2433]
["1717477704122692",2434]
["171747770538482",2435]
["1717477706122622",2436]
["1717477715188292",2437]
["1717477718188281",2438]
["1717477721162056",2439]
["1717477742188271",2440]
["1717478654189087",2441]
["1717477880188492",2442]
["1717477622176729",2443]
["171747776748541",2444]
["171747775541139",2445]
["1717478002134558",2446]
["1717477873188557",2447]
["171747805747502",2448]
["1717477750160764",2449]
["1717478025188526",2450]
["1717477817188482",2451]
["1717477914188532",2452]
["1717477976188595",2453]
["1717477753188346",2454]
["1717478023129119",2455]
["1717477829140355",2456]
["1717477870178455",2457]
["1717478012188599",2458]
["1717477917129242",2459]
["1717477911188478",2460]
["1717478097188533",2461]
["171747801311487",2462]
["1717477796188431",2463]
["1717477848188470",2464]
["1717478074156764",2465]
["1717477929123155",2466]
["1717477861175881",2467]
["1717477966188502",2468]
["1717477935188509",2469]
["1717478004188549",2470]
["1717478026188560",2471]
["1717478005188574",2472]
["1717477978188636",2473]
["1717477920147624",2474]
["1717477844154275",2475]
["1717477986178187",2476]
["1717477969188520",2477]
["1717478014188540",2478]
["1717477902188613",2479]
["171747808219796",2480]
["1717478085109277",2481]
["1717477970161686",2482]
["1717477995188538",2483]
["1717478060188554",2484]
["171747800919289",2485]
["171747805581310",2486]
["1717478069121744",2487]
["1717477950133597",2488]
["1717477816188445",2489]
["1717477853188471",2490]
["1717478007188487",2491]
["1717478053188564",2492]
["1717477937188575",2493]
["1717478079188617",2494]
["1717477948188629",2495]
["171747800115664",2496]
["1717477831150588",2497]
["1717477951154719",2498]
["1717478036188619",2499]
["1717478234188826",2500]
["171747801077749",2501]
["1717478115188654",2502]
["171747824158647",2503]
["1717478114188657",2504]
["1717478118123809",2505]
["1717478037188592",2506]
["1717478236188828",2507]
["1717478146188837",2508]
["1717478185188745",2509]
["1717478166188736",2510]
["171747812359799",2511]
["1717478207159677",2512]
["1717478181168988",2513]
["1717478182188762",2514]
["1717478238188862",2515]
["1717478237188854",2516]
["1717478342145997",2517]
["1717478155188737",2518]
["1717478183188772",2519]
["1717478343188844",2520]
["1717478202158117",2521]
["1717478223188845",2522]
["171747824818452",2523]
["1717478246155022",2524]
["1717478289188802",2525]
["1717478194188841",2526]
["1717478224188849",2527]
["171747819211365",2528]
["171747830660695",2529]
["171747830563141",2530]
["171747830779390",2531]
["171747829979662",2532]
["1717478259102692",2533]
["1717478247114200",2534]
["1717478277142012",2535]
["1717478257154080",2536]
["1717478302163451",2537]
["1717478303163488",2538]
["1717478308172851",2539]
["1717478158188733",2540]
["1717478153188738",2541]
["1717478152188740",2542]
["1717478219188806",2543]
["1717478335188818",2544]
["1717478359188824",2545]
["1717478292188838",2546]
["1717478329188839",2547]
["1717478318188847",2548]
["1717478205188848",2549]
["1717478304188852",2550]
["1717478161173848",2551]
["1717478393105766",2552]
["171747841317089",2553]
["1717478392188903",2554]
["1717478357167996",2555]
["171747839910459",2556]
["1717478570188955",2557]
["1717478361188883",2558]
["1717478371188884",2559]
["1717478582189028",2560]
["1717478545189007",2561]
["17174785209518",2562]
["1717478597154623",2563]
["1717478598189015",2564]
["1717478599189025",2565]
["1717478600189027",2566]
["1717478513170935",2567]
["1717478444188981",2568]
["1717478471151400",2569]
["1717478557188985",2570]
["171747853257473",2571]
["171747845860727",2572]
["171747844863395",2573]
["171747845679389",2574]
["171747844991635",2575]
["171747846296231",2576]
["1717478453115587",2577]
["1717478455125216",2578]
["1717478573138064",2579]
["1717478450143633",2580]
["1717478451150776",2581]
["1717478452151806",2582]
["1717478586152971",2583]
["1717478501163393",2584]
["1717478454188928",2585]
["1717478431188931",2586]
["1717478472188948",2587]
["1717478473188950",2588]
["1717478585188962",2589]
["1717478529188990",2590]
["1717478611189024",2591]
["171747844660946",2592]
["1717478665153053",2593]
["1717478635189063",2594]
["1717478575189066",2595]
["171747860560303",2596]
["1717478647189095",2597]
["171747869356266",2598]
["1717478686189093",2599]
["1717478667189096",2600]
["1717478823189235",2601]
["1717478634189064",2602]
["1717478675150028",2603]
["1717478857189229",2604]
["1717478768115254",2605]
["1717478698189111",2606]
["1717478836189186",2607]
["1717478776183684",2608]
["1717478671189076",2609]
["1717478718189108",2610]
["1717478870189202",2611]
["1717478784189158",2612]
["1717478785189159",2613]
["171747881875753",2614]
["1717478817130809",2615]
["1717478837143842",2616]
["1717478806151527",2617]
["1717478838165936",2618]
["1717478769167561",2619]
["1717478853189224",2620]
["1717478852189238",2621]
["1717478901189247",2622]
["17174787349927",2623]
["171747877415016",2624]
["171747886223361",2625]
["171747878725758",2626]
["1717478731160700",2627]
["1717478722189106",2628]
["1717478873189177",2629]
["1717478856189217",2630]
["1717478848189210",2631]
["1717478858189233",2632]
["1717480795190914",2633]
["171748078635000",2634]
["1717480777190637",2635]
["171748077630253",2636]
["171748076782025",2637]
["171748076589546",2638]
["1717480764190918",2639]
["171748076312637",2640]
["1717480759190916",2641]
["1717480758159058",2642]
["171748075660639",2643]
["1717480693190814",2644]
["1717480687190710",2645]
["1717480686190792",2646]
["1717480683191083",2647]
["1717480682190893",2648]
["1717480677190900",2649]
["1717480676120246",2650]
["171748067597166",2651]
["1717480333156193",2652]
["1717480322190551",2653]
["1717480302190392",2654]
["1717480293190314",2655]
["1717480290191191",2656]
["1717480274190181",2657]
["1717480012190504",2658]
["1717479970190494",2659]
["1717479965153545",2660]
["1717479961190140",2661]
["1717479917190467",2662]
["1717479916190107",2663]
["1717479908190468",2664]
["1717479561145056",2665]
["171747955879586",2666]
["1717479552161243",2667]
["1717479509190086",2668]
["1717479505190072",2669]
["171747919541490",2670]
["1717479192189470",2671]
["1717480670190691",2672]
["1717479018189341",2673]
["1717479017189320",2674]
["1717479016189318",2675]
["1717479015189331",2676]
["1717479014189327",2677]
["1717479013189340",2678]
["1717479012189338",2679]
["1717479011189326",2680]
["171747901013128",2681]
["1717479009189323",2682]
["1717480489190727",2683]
["1717480464190807",2684]
["1717480460190818",2685]
["1717480398190622",2686]
["1717480393190591",2687]
["1717480387162279",2688]
["171748038131720",2689]
["1717480325190115",2690]
["1717480211190284",2691]
["1717479782190232",2692]
["1717479457189997",2693]
["171747892782927",2694]
["171748081181184",2695]
["1717480779191001",2696]
["1717480732104718",2697]
["1717480730177947",2698]
["1717480729190249",2699]
["1717480719190390",2700]
["171748064517709",2701]
["1717480643173590",2702]
["1717480642156012",2703]
["1717480636190415",2704]
["171748031321685",2705]
["171748031210004",2706]
["171748031112650",2707]
["171748031013123",2708]
["1717480307190285",2709]
["1717480306149279",2710]
["171748027058403",2711]
["1717480269190566",2712]
["1717480268190567",2713]
["1717480251190355",2714]
["171748025021418",2715]
["1717480245161631",2716]
["1717480243190573",2717]
["171748024239294",2718]
["1717480240190527",2719]
["1717480229158178",2720]
["1717480186190256",2721]
["1717480180190215",2722]
["1717480179190799",2723]
["1717480145190126",2724]
["1717480100148304",2725]
["1717479966190271",2726]
["1717479887190144",2727]
["1717479886190410",2728]
["1717479859190102",2729]
["171747982360332",2730]
["1717479822190104",2731]
["1717479660190498",2732]
["171747965956958",2733]
["171747963112265",2734]
["1717479517150694",2735]
["1717479501190004",2736]
["1717479489102612",2737]
["1717479456189994",2738]
["1717479454189986",2739]
["1717479326153303",2740]
["1717479189189445",2741]
["171747915229998",2742]
["1717479151131742",2743]
["171747912729141",2744]
["1717479081156676",2745]
["171747907860398",2746]
["1717478998131895",2747]
["1717478996189369",2748]
["1717478935189265",2749]
["1717477038186460",2750]
["1717476730/1717476731/1717476941186207",2751]
["171748063081809",2752]
["1717480628190919",2753]
["1717480627140340",2754]
["1717480623191038",2755]
["1717480565153211",2756]
["1717480558190663",2757]
["171748051839097",2758]
["1717480506191210",2759]
["1717480410190849",2760]
["1717480368190375",2761]
["171748026537654",2762]
["1717480256190439",2763]
["1717480219190174",2764]
["1717480218190180",2765]
["1717480217190172",2766]
["1717480216190177",2767]
["171748021437691",2768]
["1717480213190176",2769]
["1717480126190723",2770]
["171748012532233",2771]
["1717480124152255",2772]
["1717480113190749",2773]
["1717480047190473",2774]
["1717479825190210",2775]
["1717479771153242",2776]
["171747976717166",2777]
["1717479724190538",2778]
["171747972379258",2779]
["1717479691190110",2780]
["1717479676190395",2781]
["1717479673190397",2782]
["17174795291487",2783]
["171747942516781",2784]
["171747941878379",2785]
["1717479417160782",2786]
["1717479394189586",2787]
["1717480660190716",2788]
["171748063932180",2789]
["171748063322394",2790]
["1717480581190493",2791]
["171748055617594",2792]
["1717480436158150",2793]
["171748030942324",2794]
["171748028211890",2795]
["171748026618990",2796]
["1717480261166679",2797]
["171748016638079",2798]
["1717480151154160",2799]
["1717480111190756",2800]
["1717480069190655",2801]
["1717480067190654",2802]
["1717479990190339",2803]
["1717479984190304",2804]
["1717479903190279",2805]
["1717479893166898",2806]
["1717479809153016",2807]
["1717479528189990",2808]
["1717479463152260",2809]
["1717479461189993",2810]
["1717479459189987",2811]
["1717479236150513",2812]
["1717479230189418",2813]
["1717479225189416",2814]
["171748084182195",2815]
["1717480827190667",2816]
["1717480825137891",2817]
["1717480823170741",2818]
["1717480821190764",2819]
["1717480819190820",2820]
["1717480814190951",2821]
["1717480809190305",2822]
["171748080620853",2823]
["1717480722190479",2824]
["1717480718149562",2825]
["1717480717190495",2826]
["1717480681190474",2827]
["171748053275188",2828]
["171748048611895",2829]
["1717480475190421",2830]
["171748045199039",2831]
["1717480385191192",2832]
["1717480356190379",2833]
["1717480352151881",2834]
["1717480351190419",2835]
["1717480347190911",2836]
["1717480107177783",2837]
["1717480093190579",2838]
["1717480090190387",2839]
["1717480024190363",2840]
["1717480011148042",2841]
["1717480004169653",2842]
["1717480003124377",2843]
["1717479994119285",2844]
["1717479988190477",2845]
["1717479974190254",2846]
["1717479752183373",2847]
["1717479730142994",2848]
["1717479701153332",2849]
["1717479636162256",2850]
["1717479621190042",2851]
["1717479619190038",2852]
["171747957913838",2853]
["1717479578190020",2854]
["1717479399189540",2855]
["171747936729062",2856]
["1717479364120145",2857]
["1717479363189537",2858]
["171747936015586",2859]
["1717479259122757",2860]
["1717479251189485",2861]
["1717479221189401",2862]
["1717479214158544",2863]
["171747909491246",2864]
["1717480657190824",2865]
["1717480654190828",2866]
["1717480652123834",2867]
["1717480294134389",2868]
["1717480239190511",2869]
["1717480185190529",2870]
["1717480184190543",2871]
["1717480157132711",2872]
["1717480088190588",2873]
["1717479644190264",2874]
["171747956918207",2875]
["1717479513165260",2876]
["171747947611410",2877]
["1717478988161726",2878]
["1717475099/171747510032746",2879]
["1717475099/171747510095677",2880]
["1717475099/171747510038030",2881]
["1717475099/171747510095531",2882]
["1717475099/171747510041799",2883]
["1717475099/1717475100183487",2884]
["1717475099/1717475100183484",2885]
["1717475099/1717475100183485",2886]
["1717475099/1717475100183488",2887]
["1717475099/171747510038032",2888]
["1717475099/1717475100183486",2889]
["1717480417120984",2890]
["171748041548997",2891]
["1717480336156066",2892]
["1717479997133909",2893]
["1717480836191070",2894]
["1717480822169599",2895]
["1717480802190679",2896]
["1717480796190748",2897]
["1717480791190957",2898]
["1717480750190925",2899]
["1717480749191069",2900]
["1717480736190642",2901]
["1717480689190878",2902]
["1717480679190866",2903]
["1717480611190541",2904]
["1717480586136135",2905]
["1717480542190741",2906]
["1717480538190780",2907]
["1717480382191033",2908]
["171748036756021",2909]
["1717480366190221",2910]
["171748036510433",2911]
["1717480349171016",2912]
["171748033980088",2913]
["1717480286191159",2914]
["171748020579151",2915]
["1717480199190577",2916]
["1717480198190496",2917]
["171748018135469",2918]
["171748016510847",2919]
["1717480146190791",2920]
["171748014031884",2921]
["1717480120190354",2922]
["1717480082190218",2923]
["1717480081190201",2924]
["171748000116141",2925]
["1717479996136636",2926]
["1717479951190440",2927]
["171747994932253",2928]
["171747993862409",2929]
["1717479892190455",2930]
["1717479865158470",2931]
["1717479824150151",2932]
["1717479787190328",2933]
["1717479758190275",2934]
["1717479700190146",2935]
["1717479677190459",2936]
["171747967277816",2937]
["1717479658190306",2938]
["1717479571190070",2939]
["171747956823347",2940]
["1717479514190000",2941]
["1717479449171197",2942]
["1717479398190060",2943]
["1717479379189557",2944]
["171747937560569",2945]
["1717479348189597",2946]
["1717479334189548",2947]
["1717479267189521",2948]
["1717479209189447",2949]
["1717479207148138",2950]
["171747908717056",2951]
["1717478964189322",2952]
["1717478963171480",2953]
["17174789629583",2954]
["1717477334158847",2955]
["1717477334162937",2956]
["171748016037581",2957]
["1717479799149073",2958]
["1717480860191047",2959]
["1717480844120006",2960]
["1717480638152152",2961]
["1717480590150509",2962]
["1717480571190936",2963]
["1717480570190934",2964]
["1717480569190935",2965]
["1717480481190977",2966]
["1717480404190823",2967]
["171748040317282",2968]
["171748040022725",2969]
["1717480223126951",2970]
["1717480222162468",2971]
["1717480221190598",2972]
["1717480197190492",2973]
["1717480167190508",2974]
["1717480063113528",2975]
["1717480062190231",2976]
["1717480044190323",2977]
["1717480037174865",2978]
["1717480027190547",2979]
["1717479874190414",2980]
["1717479851190406",2981]
["171747978998109",2982]
["1717479734161306",2983]
["1717479717190130",2984]
["1717479667156241",2985]
["1717479645190187",2986]
["171747964325586",2987]
["1717479639190193",2988]
["171747963746511",2989]
["1717479633190189",2990]
["171747962823068",2991]
["1717479386189545",2992]
["171747930815083",2993]
["1717480744160377",2994]
["171748073930433",2995]
["1717480715153208",2996]
["1717480601163291",2997]
["1717480467127155",2998]
["1717480422190810",2999]
["1717480362190682",3000]
["1717480196190523",3001]
["1717480194190580",3002]
["1717480191181000",3003]
["1717480190180998",3004]
["1717480187161702",3005]
["1717480176190237",3006]
["1717480173190681",3007]
["1717480170190609",3008]
["1717480169166151",3009]
["1717480162190608",3010]
["1717480096190514",3011]
["1717479945190365",3012]
["1717479791147363",3013]
["171747977216574",3014]
["1717479493189974",3015]
["1717479481189969",3016]
["171747946846691",3017]
["1717479450158545",3018]
["1717480813190731",3019]
["171748075260114",3020]
["1717480386190411",3021]
["1717480233190539",3022]
["1717480172114353",3023]
["1717480168190308",3024]
["1717480152190333",3025]
["1717479955190183",3026]
["171747994122193",3027]
["171747973737813",3028]
["1717479697190098",3029]
["171747967913580",3030]
["1717479338189529",3031]
["1717479093189371",3032]
["1717477350186843",3033]
["1717477350186835",3034]
["1717477350186844",3035]
["171748072198107",3036]
["1717480535144747",3037]
["1717480534144748",3038]
["1717480531190582",3039]
["1717480525144743",3040]
["1717480522144744",3041]
["1717480521190886",3042]
["1717480520144749",3043]
["1717480517144746",3044]
["1717480516145749",3045]
["1717480515145750",3046]
["1717480512190719",3047]
["1717480509144745",3048]
["1717480407190798",3049]
["1717480384190537",3050]
["1717480203190227",3051]
["1717480118190346",3052]
["1717480110190507",3053]
["1717480055190167",3054]
["1717480035151259",3055]
["1717479778190203",3056]
["1717479775190251",3057]
["1717479773190196",3058]
["171747975767048",3059]
["1717479754190266",3060]
["171747975381957",3061]
["1717479750190229",3062]
["1717479749190226",3063]
["1717479748190267",3064]
["1717479747190122",3065]
["1717479681190427",3066]
["1717479440189591",3067]
["1717480846124296",3068]
["1717480455152969",3069]
["1717480426135880",3070]
["1717480425190909",3071]
["1717480338190750",3072]
["17174803373480",3073]
["1717480094153306",3074]
["1717480092190141",3075]
["1717480076190312",3076]
["171747970257159",3077]
["1717479683135482",3078]
["1717480748190990",3079]
["1717480153190815",3080]
["1717479699156385",3081]
["1717479466190035",3082]
["171748072871194",3083]
["1717480724132751",3084]
["1717480710158343",3085]
["1717480705116565",3086]
["1717480704105407",3087]
["171748070328833",3088]
["171748070255740",3089]
["1717480698191046",3090]
["171748067332047",3091]
["1717480672148299",3092]
["171748067140428",3093]
["1717480544190420",3094]
["1717480246191189",3095]
["1717480208138062",3096]
["1717480175154246",3097]
["171748015829403",3098]
["1717479843107645",3099]
["1717479829151268",3100]
["171747982077393",3101]
["1717479816148722",3102]
["1717479798145830",3103]
["1717479694190125",3104]
["1717479537190041",3105]
["1717479498178307",3106]
["171747934656170",3107]
["1717479122189432",3108]
["1717479121189435",3109]
["1717480595149100",3110]
["1717480468190787",3111]
["171748042939196",3112]
["171748042852976",3113]
["171748042782985",3114]
["1717480182144073",3115]
["1717480129162052",3116]
["1717480119190581",3117]
["1717480108171428",3118]
["1717480105190294",3119]
["1717480025190501",3120]
["1717479998190461",3121]
["1717479991190272",3122]
["171747987778272",3123]
["1717479766144059",3124]
["1717479765143966",3125]
["171747970918111",3126]
["1717479587142826",3127]
["1717479546190025",3128]
["171747944266326",3129]
["1717479298189467",3130]
["1717479169154597",3131]
["1717479155144779",3132]
["1717480644171049",3133]
["1717480471109592",3134]
["1717480319190586",3135]
["1717480232169663",3136]
["1717479598190191",3137]
["1717480508190587",3138]
["171748050731969",3139]
["1717480228190100",3140]
["1717479956190245",3141]
["171747899981127",3142]
["1717480851191007",3143]
["1717480847145137",3144]
["1717480835191106",3145]
["1717480833145747",3146]
["1717480768190662",3147]
["171748061660106",3148]
["1717480602190930",3149]
["1717480554151866",3150]
["1717480553191056",3151]
["1717480551127882",3152]
["1717480545190094",3153]
["1717480533126428",3154]
["1717480526190774",3155]
["1717480514191036",3156]
["1717480505190689",3157]
["1717480504190688",3158]
["1717480503133853",3159]
["1717480502190687",3160]
["1717480501190700",3161]
["1717480500190685",3162]
["1717480499190683",3163]
["1717480498190684",3164]
["1717480497190986",3165]
["1717480462190613",3166]
["1717480406190525",3167]
["171748036999836",3168]
["1717480296190513",3169]
["1717480193149525",3170]
["1717480156149526",3171]
["1717480143140643",3172]
["1717480142190377",3173]
["1717480138190383",3174]
["1717480137190733",3175]
["1717480136190717",3176]
["1717480121144218",3177]
["1717480078190568",3178]
["171748007140445",3179]
["1717480028190476",3180]
["1717480000190248",3181]
["1717479957152740",3182]
["1717479819108690",3183]
["171747978522569",3184]
["171747978133169",3185]
["1717479779143527",3186]
["1717479763151046",3187]
["1717479762151049",3188]
["1717479761150296",3189]
["171747975533018",3190]
["1717479735141002",3191]
["1717479721190208",3192]
["1717479720190202",3193]
["1717479682190371",3194]
["1717479662190334",3195]
["1717479595151505",3196]
["1717479576190058",3197]
["1717479467147925",3198]
["1717479451154136",3199]
["1717479446159008",3200]
["1717479444141063",3201]
["171747943815320",3202]
["1717479436102821",3203]
["171747943537493",3204]
["171747943449266",3205]
["171747943333392",3206]
["171747942232155",3207]
["1717479421156839",3208]
["1717479416156838",3209]
["171747941496424",3210]
["171747941381571",3211]
["1717479350117142",3212]
["1717479262189491",3213]
["1717479252127014",3214]
["1717479235148074",3215]
["171747906160368",3216]
["171747906060762",3217]
["1717479050159021",3218]
["1717479020127527",3219]
["1717478947189287",3220]
["1717478946189288",3221]
["171748064896608",3222]
["1717480626165225",3223]
["1717480552125727",3224]
["1717480249105623",3225]
["171748023760199",3226]
["1717480236158785",3227]
["1717480235105635",3228]
["1717480189190638",3229]
["1717480178163443",3230]
["171748009923525",3231]
["171748006870889",3232]
["1717479888174615",3233]
["1717479475190009",3234]
["1717479387189996",3235]
["1717480871153225",3236]
["1717481126191160",3237]
["1717481101133589",3238]
["1717481067190630",3239]
["171748100033231",3240]
["1717481073191279",3241]
["1717472945/1717472946178223",3242]
["1717480861190772",3243]
["1717480954148454",3244]
["171748099137759",3245]
["1717481072191280",3246]
["1717481104190861",3247]
["171748100960934",3248]
["171748085924574",3249]
["1717481079191344",3250]
["1717480938191223",3251]
["1717481027191392",3252]
["1717481292190998",3253]
["1717480900190213",3254]
["1717481035191389",3255]
["171748100460949",3256]
["1717478982189316",3257]
["171748102094860",3258]
["1717480972190763",3259]
["1717481262190834",3260]
["1717481239190903",3261]
["1717481044190632",3262]
["1717481128191365",3263]
["1717481261190460",3264]
["1717481084191292",3265]
["1717481182125836",3266]
["1717480998149625",3267]
["1717481230163351",3268]
["1717481161191405",3269]
["1717481194191220",3270]
["171748113660883",3271]
["1717480891190953",3272]
["1717480848190795",3273]
["171748122526236",3274]
["1717480901191235",3275]
["1717480996190752",3276]
["1717480939168547",3277]
["1717481160191407",3278]
["1717481158191404",3279]
["1717481159191406",3280]
["1717481180191293",3281]
["1717481275191380",3282]
["1717480876130850",3283]
["1717481144146396",3284]
["8300008142169529",3285]
["1717481280146657",3286]
["1717480850190789",3287]
["1717481218183341",3288]
["1717480867145768",3289]
["1717481017152574",3290]
["1717480956190658",3291]
["1717481050190629",3292]
["1717480976132835",3293]
["1717481288190784",3294]
["1717481216153503",3295]
["17174810471137",3296]
["1717481117181476",3297]
["1717480949191265",3298]
["1717480885191243",3299]
["1717480904190759",3300]
["1717481185191359",3301]
["1717480977170593",3302]
["1717481066166226",3303]
["17174808433809",3304]
["1717472566147552",3305]
["171748100133230",3306]
["1717481176183929",3307]
["1717481029191308",3308]
["1717481269191419",3309]
["1717480971191274",3310]
["1717481055190931",3311]
["1717480979190888",3312]
["171748099922122",3313]
["1717481154191239",3314]
["1717480951143865",3315]
["171748096135219",3316]
["1717480147158914",3317]
["1717481217191305",3318]
["171748100894861",3319]
["171748100233232",3320]
["1717479021189319",3321]
["1717481028165187",3322]
["1717480862190854",3323]
["1717481083190873",3324]
["1717479067189380",3325]
["1717478929189284",3326]
["1717480177190393",3327]
["171748121229102",3328]
["1717481086191354",3329]
["1717481102155436",3330]
["171748129617218",3331]
["1717481121190775",3332]
["1717481294191356",3333]
["171748096941272",3334]
["1717481016147339",3335]
["1717481089191053",3336]
["171748099430260",3337]
["1717480909141571",3338]
["1717481087190825",3339]
["1717481123190892",3340]
["1717481240190901",3341]
["1717480902190742",3342]
["1717481108191325",3343]
["1717480896147505",3344]
["1717480869191257",3345]
["1717481056144954",3346]
["1717481120174692",3347]
["1717481116181477",3348]
["1717480993158182",3349]
["1717480921190761",3350]
["1717480910190758",3351]
["171748107744780",3352]
["1717481052190634",3353]
["1717481053190627",3354]
["1717481054190628",3355]
["1717472945/1717472946178222",3356]
["1717481320190794",3357]
["1717480893190786",3358]
["1717479099189450",3359]
["1717479090189428",3360]
["171748127479274",3361]
["1717481260181319",3362]
["1717481257146109",3363]
["171748087522435",3364]
["1717481229111981",3365]
["1717481109153246",3366]
["1717481119190821",3367]
["1717480579190847",3368]
["1717479091189452",3369]
["1717481060191214",3370]
["1717481134190782",3371]
["1717480888190988",3372]
["1717480974190754",3373]
["1717481093156835",3374]
["1717480970190666",3375]
["1717481065190631",3376]
["17174812659239",3377]
["1717482664192656",3378]
["1717482663192652",3379]
["1717482787192000",3380]
["1717482657192658",3381]
["1717482719192009",3382]
["1717482635158151",3383]
["1717482687146984",3384]
["1717482098191950",3385]
["1717481877191940",3386]
["1717482308191931",3387]
["1717481779191563",3388]
["1717481777191808",3389]
["171748188811400",3390]
["1717481800191933",3391]
["1717481912191932",3392]
["1717481744191774",3393]
["1717482593192323",3394]
["1717482207192159",3395]
["1717482062192135",3396]
["1717482509192131",3397]
["1717481826191761",3398]
["1717482739172472",3399]
["1717481825191748",3400]
["1717481817191729",3401]
["1717481654123436",3402]
["171748165560616",3403]
["171748165360816",3404]
["1717481982192084",3405]
["1717481667191564",3406]
["1717481697191012",3407]
["1717481835191702",3408]
["1717482359192280",3409]
["1717482406191983",3410]
["1717482030192070",3411]
["1717481914191718",3412]
["1717482041192064",3413]
["17174820449287",3414]
["1717481966192034",3415]
["171748223437673",3416]
["1717482623116617",3417]
["1717482714191982",3418]
["1717482329192016",3419]
["1717482617192400",3420]
["1717481971192010",3421]
["1717482082122650",3422]
["1717482081122649",3423]
["1717482122122652",3424]
["1717482089122645",3425]
["1717482088122623",3426]
["1717482087122624",3427]
["171748208318071",3428]
["1717482091122628",3429]
["1717482084122625",3430]
["1717482054191073",3431]
["171748213430164",3432]
["171748213510543",3433]
["1717481993191894",3434]
["1717482334192221",3435]
["1717481948191803",3436]
["1717482242191871",3437]
["171748224138507",3438]
["1717481989191885",3439]
["1717481822191868",3440]
["1717481994191866",3441]
["1717482467138902",3442]
["1717482529192209",3443]
["1717482112191973",3444]
["1717481819191858",3445]
["1717482518113630",3446]
["1717482522191958",3447]
["1717482245191956",3448]
["171748224699655",3449]
["1717481861191846",3450]
["1717481782136574",3451]
["1717481783126533",3452]
["1717481784126532",3453]
["1717481303131369",3454]
["1717481449120442",3455]
["1717481523191133",3456]
["1717481517191637",3457]
["1717481503153156",3458]
["1717481760191481",3459]
["1717481551158939",3460]
["1717481411191391",3461]
["1717481374113491",3462]
["1717481610147992",3463]
["1717481520191633",3464]
["1717481538135972",3465]
["171748161114596",3466]
["171748148713816",3467]
["1717481437191066",3468]
["1717481495190899",3469]
["1717481569141276",3470]
["1717481644191050",3471]
["171748189895241",3472]
["1717481462124144",3473]
["1717481483190736",3474]
["1717481484190737",3475]
["1717481512190950",3476]
["1717481358146065",3477]
["1717481357136387",3478]
["1717481311151630",3479]
["1717481312191458",3480]
["1717481612191457",3481]
["1717481533191216",3482]
["1717481980116703",3483]
["1717481329191452",3484]
["1717481524190790",3485]
["1717481682138334",3486]
["1717481324172396",3487]
["1717481434190999",3488]
["1717481363190833",3489]
["1717481499191598",3490]
["1717481460191418",3491]
["1717481485191081",3492]
["1717481251190989",3493]
["1717481322131534",3494]
["1717481601139152",3495]
["1717481640191401",3496]
["1717481609191394",3497]
["1717481720169213",3498]
["1717481431191240",3499]
["1717481531191078",3500]
["1717481571191559",3501]
["1717481442191438",3502]
["1717481672191379",3503]
["1717481536162151",3504]
["1717481570102007",3505]
["1717481461136679",3506]
["1717481637162492",3507]
["1717481622191663",3508]
["1717481625170449",3509]
["1717481624191664",3510]
["1717481623170456",3511]
["1717481598191661",3512]
["1717481468191035",3513]
["1717481567191289",3514]
["1717481664191221",3515]
["1717481486190777",3516]
["1717481607137848",3517]
["1717481494191520",3518]
["1717481614190816",3519]
["1717481659191314",3520]
["171748161530584",3521]
["1717481298191338",3522]
["1717481497191642",3523]
["1717481671191352",3524]
["1717481740191515",3525]
["1717481283191514",3526]
["1717481366163953",3527]
["1717481573191509",3528]
["1717481439139916",3529]
["1717481333191502",3530]
["171748151839258",3531]
["1717481587191172",3532]
["1717481636152466",3533]
["1717481364191499",3534]
["1717481559191635",3535]
["1717481404191330",3536]
["1717481477139132",3537]
["1717481827105072",3538]
["1717481314116931",3539]
["1717481961190857",3540]
["1717481440190785",3541]
["1717481708190760",3542]
["1717481709190753",3543]
["1717482862192419",3544]
["1717482906191500",3545]
["171748294628977",3546]
["1717482957192812",3547]
["1717483010173602",3548]
["171748305523994",3549]
["1717482996192843",3550]
["1717483053192839",3551]
["1717482973192894",3552]
["1717483243193013",3553]
["171748323149036",3554]
["1717483500193453",3555]
["1717483499141452",3556]
["1717483562162509",3557]
["171748358858807",3558]
["171748361760133",3559]
["1717483622168004",3560]
["1717483401193482",3561]
["1717483715193630",3562]
["171748374378794",3563]
["1717483771193691",3564]
["1717483967193737",3565]
["1717483968112636",3566]
["171748388846422",3567]
["1717481788191747",3568]
["1717481858191727",3569]
["1717482179192139",3570]
["1717482302192128",3571]
["1717482859191991",3572]
["1717482907149479",3573]
["1717483011192597",3574]
["1717483247193289",3575]
["1717483481193370",3576]
["1717484053193896",3577]
["1717484074193922",3578]
["1717484150193953",3579]
["1717484155193953",3579]
["1717484152193961",3580]
["1717484153193961",3580]
["1717484203193969",3581]
["1717484148142426",3582]
["1717484388194153",3583]
["1717484388194154",3584]
["1717484511194308",3585]
["1717484452194216",4008]
["1717484719194382",4009]
["1717484488194372",4010]
["1717473205180332"]
["1717473205180332"]
["1717475573184223"]
["1717457897154042"]
["17174597621442"]
["1717466142168386"]
["1717467198170253"]
["1717467913171913"]
["171747039446448"]
["1717470929146904"]
["1717471111176886"]
["1717471201177076"]
["1717471401177257"]
["1717471323177336"]
["171747174838758"]
["1717471764178101"]
["1717472476179271"]
["1717475574184223"]
["1717468309172287"]
["1717484735194397",3586]
["1740000043154922",3587]
["1740000059168357",3588]
["1740000298194469",3589]
["174000021930321",3590]
["174000021730342",3591]
["1740000156145752",3592]
["1740000207142247",3593]
["174000020619588",3594]
["174000020531826",3595]
["174000020428033",3596]
["1740000224157721",3597]
["1740000230157710",3598]
["1740000226157723",3599]
["1740000228157722",3600]
["1740000239194481",3601]
["1740000146194482",3602]
["1740000124194493",3603]
["1740000381194495",3604]
["1740000380194498",3605]
["1740000172194504",3606]
["1740000049194506",3607]
["1740000071194502",3608]
["1740000391194518",3609]
["1740000081194531",3610]
["1740000086194542",3611]
["1740000084194539",3612]
["174000008722440",3613]
["1740000082194549",3614]
["1740000008194551",3615]
["1740000348194580",3616]
["1740000101194604",3617]
["1740000308194595",3618]
["174000024923695",3619]
["174000000330142",3620]
["1740000009194584",3621]
["1740000316194592",3622]
["1740000121194561",3623]
["174000014817895",3624]
["1740000301194685",3625]
["1740000260194655",3626]
["174000022333066",3627]
["174000017158954",3628]
["174000025720947",3629]
["1740000098194671",3630]
["174000006992981",3631]
["1740000266123471",3632]
["1740000033194665",3633]
["1740000427144026",3634]
["1740000452194700",3635]
["174000026429939",3636]
["1740000437194748",3637]
["1740000382194760",3638]
["1740000335194759",3639]
["1740000322194773",3640]
["1740000458194792",3641]
["174000051999071",3642]
["1740000281194808",3643]
["1740000539194809",3644]
["174000049062794",3645]
["1740000500194823",3646]
["174000066311150",3647]
["174000056181361",3648]
["1740000500194819",3649]
["1740000794194825",3650]
["1740000829168122",3651]
["1740000730194847",3652]
["1740000729152571",3653]
["1740000727194843",3654]
["1740000726194845",3655]
["1740000725174302",3656]
["1740000651174309",3657]
["1740000714194846",3658]
["1740000713194856",3659]
["1740000712194858",3660]
["1740000711194849",3661]
["1740000710194850",3662]
["1740000709194851",3663]
["1740000701194852",3664]
["1740000699194848",3665]
["174000070063805",3666]
["1740000698174301",3667]
["1740000652194855",3668]
["1740000626194869",3669]
["174000069537526",3670]
["174000080146510",3671]
["1740000708122439",3672]
["1740000707122440",3673]
["1740000773194883",3674]
["1740000551194887",3675]
["1740000761143373",3676]
["1740000742194888",3677]
["1740000660194896",3678]
["1740000603194890",3679]
["1740000740194891",3680]
["1740000684194907",3681]
["1740000643194904",3682]
["174000059160556",3683]
["1740000661194894",3684]
["1740000797179800",3685]
["1740000828162101",3686]
["1740000587161727",3687]
["1740000612194897",3688]
["1740000614194898",3689]
["1740000702194899",3690]
["1740000590194895",3691]
["1740000862141767",3692]
["1740000594194892",3693]
["174000077925473",3694]
["1740000833194939",3695]
["1740000562194914",3696]
["174000078033171",3697]
["1740000598194930",3698]
["174000061015035",3699]
["1740000583194926",3700]
["1740000518194919",3701]
["1740000442194936",3702]
["174000071619658",3703]
["1740000835150148",3704]
["1740000607194946",3705]
["174000078130316",3706]
["1740000665194950",3707]
["1740000803194974",3708]
["174000075847060",3709]
["1740000667194981",3710]
["1740000668194970",3711]
["174000085168065",3712]
["1740000689194964",3713]
["1740000604151542",3714]
["1740000571195311",3715]
["1740000850194990",3716]
["1740000776195041",3717]
["1740000913195032",3718]
["1740000670195002",3719]
["174000063116188",3720]
["1740000891194999",3721]
["1740000865195011",3722]
["1740000834195000",3723]
["174000079696481",3724]
["1740000875195120",3725]
["1740000790157965",3726]
["1740000752195087",3727]
["1740000778195092",3728]
["1740000654195094",3729]
["1740000764154039",3730]
["1740000860146855",3731]
["1740000783195047",3732]
["1740000715195086",3733]
["1740000627129617",3734]
["1740000922195046",3735]
["174000099346120",3736]
["1740000768195091",3737]
["1740000517195060",3738]
["174000084556848",3739]
["1740000552195090",3740]
["174000105512248",3741]
["1740000910195171",3742]
["1740001237195182",3743]
["1740001236195183",3744]
["174000109663502",3745]
["1740001097123521",3746]
["1740000696195188",3747]
["1740001056195198",3748]
["1740000812113843",3749]
["1740001101195224",3750]
["1740002301196084",3751]
["1720001076196172",3752]
["1720000013196210",3753]
["174000226777618",3754]
["1740002266108151",3755]
["1720000028196208",3756]
["1740002075195769",3757]
["1740001986129313",3758]
["1740002169196098",3759]
["1740001998196060",3760]
["172000120210720",3761]
["1740002067196124",3762]
["1740002069196127",3763]
["1740002071196128",3764]
["1740002117196115",3765]
["1740001967195991",3766]
["1740002217196154",3767]
["1740002217196155",3768]
["1740001996107681",3769]
["174000200516018",3770]
["174000200724589",3771]
["1740002003146354",3772]
["174000200422337",3773]
["174000211217403",3774]
["1740001966195747",3775]
["17400019751641",3776]
["1740001963196192",3777]
["1740002139195977",3778]
["1740002049195916",3779]
["1740001908167197",3780]
["1740001839195935",3781]
["1740001839140336",3782]
["17400017473835",3783]
["1740001884195712",3784]
["1740002044195876",3785]
["1740001777195877",3786]
["1740001755195631",3787]
["1740001833195905",3788]
["1740001741195945",3789]
["1740002095196136",3790]
["1740001757196028",3791]
["1740001890195718",3792]
["1740001889195728",3793]
["1740001886195730",3794]
["1740001901195724",3795]
["1740001900195725",3796]
["1740001898195726",3797]
["1740001896109386",3798]
["1740001847120233",3799]
["1740001895195749",3800]
["1740001894195750",3801]
["1740001892195751",3802]
["1740001887195740",3803]
["1740001888195742",3804]
["1740001897195744",3805]
["1740001893195737",3806]
["1740001830195823",3807]
["1740001958160814",3808]
["1720000011196097",3809]
["1740001803195985",3810]
["1740001773196003",3811]
["1740001855195998",3812]
["174000207910404",3813]
["1740001822195796",3814]
["1740001822195817",3815]
["174000170144786",3816]
["1740001671110764",3817]
["1740002055195848",3818]
["1740001906145225",3819]
["1740001810195772",3820]
["1740001751195584",3821]
["1740001750195589",3822]
["1740001752195591",3823]
["1740002023195873",3824]
["1740001718195615",3825]
["174000161730789",3826]
["1740001783195650",3827]
["1740001789195830",3828]
["1740001618195825",3829]
["174000164580562",3830]
["1740001835149542",3831]
["174000163682147",3832]
["174000212332321",3833]
["1740001584141044",3834]
["1740001578195701",3835]
["1740001582195707",3836]
["1740001948195833",3837]
["1740001655147234",3838]
["1740001639196037",3839]
["1740002051159738",3840]
["1740001957195675",3841]
["1740001974195678",3842]
["1740001962195884",3843]
["174000203945703",3844]
["1740002037161626",3845]
["174000194438638",3846]
["1740001942127145",3847]
["174000194379074",3848]
["1720000034196109",3849]
["1740001506195684",3850]
["1740001858195679",3851]
["1740001857125772",3852]
["1740001522195595",3853]
["1720000031196110",3854]
["1740001581195611",3855]
["1720000032196111",3856]
["1740001715195594",3857]
["1740001335195567",3858]
["1740001907116100",3859]
["1740001717195625",3860]
["174000176758743",3861]
["1740001769195767",3862]
["1740001768195763",3863]
["1740001614195946",3864]
["1740001760195936",3865]
["1740001770195770",3866]
["1740001926142428",3867]
["1740001556195924",3868]
["1740001622195805",3869]
["1740001344195629",3870]
["1740001344195628",3871]
["174000134463086",3872]
["1740002115196071",3873]
["174000137424711",3874]
["1740001375195495",3875]
["174000143038218",3876]
["1740001230195400",3877]
["174000143131029",3878]
["1740001621195804",3879]
["1740001620195806",3880]
["1740001657195563",3881]
["174000139416879",3882]
["174000139316888",3883]
["174000139635182",3884]
["174000139921628",3885]
["1740001368134245",3886]
["1740001405150475",3887]
["174000157631498",3888]
["1740001218195416",3889]
["1740001221195417",3890]
["1740001224195410",3891]
["174000184348556",3892]
["1740001225195435",3893]
["1740001240195286",3894]
["1740001401195320",3895]
["1740001397195322",3896]
["1740001332195517",3897]
["1740001400195345",3898]
["1740001517143016",3899]
["1740001499150886",3900]
["1740001266195387",3901]
["1740001419130638",3902]
["174000207626904",3903]
["174000152049821",3904]
["174000193359648",3905]
["1740001619109334",3906]
["1740001241195434",3907]
["1740001239195436",3908]
["1740001242195438",3909]
["1740001413195494",3910]
["1740001946195815",3911]
["1740001592195442",3912]
["1740001384195332",3913]
["1740001215173017",3914]
["1740001656195562",3915]
["1740001661145410",3916]
["174000129277293",3917]
["1740001490195418",3918]
["1740001538195343",3919]
["174000134586283",3920]
["1740001535195344",3921]
["174000120419718",3922]
["1740001378145779",3923]
["1740001195124955",3924]
["1740001541140483",3925]
["1740001402195498",3926]
["174000159529072",3927]
["1740001416195515",3928]
["1740001288195389",3929]
["174000122259445",3930]
["174000121085926",3931]
["174000131645302",3932]
["1740001185195390",3933]
["1740001153195430",3934]
["17400011459240",3935]
["1740001373195302",3936]
["174000141419164",3937]
["1740001488195536",3938]
["1740001455156132",3939]
["174000140360640",3940]
["174000156779078",3941]
["1740001073195287",3942]
["174000122353657",3943]
["1740001083195256",3944]
["1740001342160770",3945]
["1740001077195525",3946]
["1740001173195325",3947]
["1740001338195481",3948]
["1740001161195340",3949]
["1740001191145160",3950]
["1740001159195351",3951]
["1740001168195471",3952]
["1740001118195382",3953]
["1740001020195423",3954]
["1740001001195391",3955]
["174000114228326",3956]
["174000187279648",3957]
["1740001290195404",3958]
["1740001003195374",3959]
["1740001129195363",3960]
["1740001607195474",3961]
["1740001347195379",3962]
["1740001346116355",3963]
["1740002030195909",3964]
["1740002034195930",3965]
["1740001008107366",3966]
["1740001483195552",3967]
["1740001468195316",3968]
["1740001341145619",3969]
["1740001132195586",3970]
["1740001523195565",3971]
["1740001312118807",3972]
["1740001106195306",3973]
["1740001366195447",3974]
["1740001365195450",3975]
["174000151830400",3976]
["1740001141195516",3977]
["174000144661606",3978]
["1740001850195658",3979]
["174000113938248",3980]
["174000104854218",3981]
["1740001146195242",3982]
["1740000939195469",3983]
["1740001449195535",3984]
["1740000976195548",3985]
["174000088622902",3986]
["1740000888195527",3987]
["174000166728930",3988]
["1740001666195635",3989]
["174000166532305",3990]
["174000125260299",3991]
["1740001306141590",3992]
["1740001929109535",3993]
["1740001554158974",3994]
["1740002017195812",3995]
["1740001776195801",3996]
["1740001274195263",3997]
["1740001084195335",3998]
["1740000535195299",3999]
["1740001432114833",4000]
["1740001323110980",4001]
["1740001313195393",4002]
["1740001247195395",4003]
["1740001502195290",4004]
["1740001844123160",4005]
["1740001103195314",4006]
["1740001150195324",4007]
["1740000227194602",4011]
["1740000265194670",4012]
["1740000024194458",4013]
["1740000578194933",4014]
["1740000255194676",4015]
["1740000825195109",4016]
["1740000113194658",4017]
["1740000394194726",4018]
["1740000189194540",4019]
["1740001781196049",4020]
["1740001780196052",4021]
["1740000462194761",4022]
["1740000484194863",4023]
["1740000746194935",4024]
["1740001318195384",4025]
["1740000787194828",4026]
["1740000506194815",4027]
["1740000632194924",4028]
["1740000611195076",4029]
["1740001032195189",4030]
["1740001112147778",4031]
["1740000741194927",4032]
["1740000868195173",4033]
["1740000917195218",4034]
["1740001782195727",4035]
["1740001635195683",4036]
["1740000905195213",4037]
["1740000748195291",4038]
["1740001098195264",4039]
["1740000997195309",4040]
["1740001115195194",4041]
["1740001116195270",4042]
["1740001227195304",4043]
["1740001339195347",4044]
["1740001343195346",4045]
["1740001310195432",4046]
["1720001016196282",4047]
["1740001007195210",4048]
["1740001128195272",4049]
["1740001102195260",4050]
["1740001164195451",4051]
["1720001755168642",4052]
["1740001470195328",4053]
["174000116716540",4054]
["1740001187195262",4055]
["1740001248195511",4056]
["1740001542195831",4057]
["1740001440168410",4058]
["1740001174195554",4059]
["1740001487195557",4060]
["1740001315195284",4061]
["1740001300142073",4062]
["1740001469195493",4063]
["1740001563195422",4064]
["1740001610195426",4065]
["1740001519195597",4066]
["1720001508142122",4067]
["1740001276195539",4068]
["1740001930181323",4069]
["1740001457195596",4070]
["1740001863195653",4071]
["1740001868195649",4072]
["174000207787126",4073]
["1720001407196370",4074]
["1740001852195624",4075]
["1740002277195970",4076]
["1740001632195571",4077]
["1720000009196093",4078]
["1740002283146942",4079]
["1740001438171951",4080]
["1720001215111716",4081]
["1740001572195699",4082]
["1720001369152487",4083]
["174000200291739",4084]
["1740001673196072",4085]
["1720001543151360",4086]
["1740002038196134",4087]
["1740001807195719",4088]
["1740002224196193",4089]
["1740001686196029",4090]
["1740001802195775",4091]
["1720001281173868",4092]
["1740002282196118",4093]
["1740001823195875",4094]
["1740002274196044",4095]
["1740002040195840",4096]
["1740002057195903",4097]
["1740001804195774",4098]
["1720000003145305",4099]
["1740002180195829",4100]
["1720001879145919",4101]
["1720001110196263",4102]
["1740002022195920",4103]
["1720001367196353",4104]
["1720001362170005",4105]
["1720001279196221",4106]
["1720001426165265",4107]
["1720001766196755",4108]
["172000170247590",4109]
["172000000760834",4110]
["1720001292196278",4111]
["1720001398196357",4112]
["1740002292196080",4113]
["1720001046196325",4114]
["1720001044196342",4115]
["1720001047196341",4116]
["1740002126147681",4117]
["1720001058196123",4118]
["172000109837713",4119]
["1740002122196439",4120]
["1740002121196437",4121]
["174000224331501",4123]
["1720001039131370",4124]
["1720001544196617",4125]
["1720001086196576",4126]
["1720001342152507",4127]
["1720001446108735",4128]
["172000105321948",4129]
["1720001634112808",4130]
["1740002249196239",4131]
["1720000018196408",4132]
["1720001527196683",4133]
["1720001626196664",4134]
["1720001302101866",4135]
["1720001305196305",4136]
["1720001031196376",4137]
["172000153011360",4138]
["1720001524196611",4139]
["1720001633155749",4140]
["1720001252196247",4141]
["1720001015196255",4142]
["1720001883196781",4143]
["1720001373145439",4145]
["1740002291196076",4146]
["1720001003196250",4147]
["1720001243196268",4148]
["172000128422442",4149]
["1720001394196581",4150]
["1720001074196588",4151]
["1720001080196280",4152]
["1720001083196289",4153]
["1720001043196286",4154]
["1720001028196364",4155]
["1720001339196293",4156]
["17200013859613",4157]
["1720001448196667",4158]
["1720001236196301",4159]
["172000123811460",4160]
["1720001474196547",4161]
["1720001519196430",4162]
["1720001217196431",4163]
["172000165914140",4164]
["1720001741196856",4165]
["1720001901196855",4166]
["1720001092196380",4167]
["1720001762196851",4168]
["1720001480177382",4169]
["1720001173196583",4170]
["1720001150196554",4173]
["1720001091196402",4174]
["1720001427196334",4175]
["172000127799684",4176]
["172000181213940",4177]
["1720001401149493",4178]
["1720001304196612",4179]
["1720001085196480",4180]
["1720001087196479",4181]
["1720001337196331",4182]
["172000162981634",4183]
["172000159239341",4184]
["1720001233196383",4185]
["1720001522196338",4186]
["1720001433196530",4187]
["1720001265196403",4188]
["1720001130196548",4189]
["1720001256196387",4190]
["1720001075196251",4191]
["1720001154119498",4192]
["1720001562196578",4193]
["1720001561196575",4194]
["1720001569196582",4195]
["1720001570196579",4196]
["1720001572196573",4197]
["1720001549196382",4198]
["1720001384196557",4199]
["1720001360196354",4200]
["1720001656196677",4201]
["172000155464765",4202]
["1720001196196635",4203]
["1720001253153926",4204]
["1720001227196656",4205]
["1720001691196692",4206]
["1720001416144105",4207]
["172000127220243",4208]
["1720001486196544",4209]
["1720001477196543",4210]
["1720001493196549",4211]
["1720001338196423",4212]
["1720001223196344",4213]
["1720001153174047",4214]
["1720001235196372",4215]
["1720001345144615",4216]
["1720001520196571",4217]
["1720001191196828",4218]
["172000129473204",4219]
["1720001397196590",4220]
["1720001320196409",4221]
["1720001577196390",4222]
["1720001295196368",4223]
["1720001319196399",4224]
["1720001322196398",4225]
["172000166336093",4226]
["1720001464196411",4228]
["1720001465196388",4229]
["1720001393196637",4230]
["1720001661196679",4231]
["1720001434196655",4232]
["1720001425196505",4233]
["1720001469196412",4234]
["1720001517196395",4235]
["1720001231196267",4236]
["1720001814168099",4237]
["1720001341196628",4238]
["1720001399196291",4239]
["1720001298196456",4240]
["1720001658190105",4241]
["1720001802145078",4242]
["1720001655196427",4243]
["172000171611627",4244]
["1720001589163663",4245]
["1720001606196595",4246]
["172000163923449",4247]
["1720001603196602",4248]
["1720001429196446",4249]
["1720001662196476",4250]
["172000185513972",4251]
["1720001671196689",4252]
["1720001586196724",4253]
["1720001785196745",4254]
["172000164460381",4255]
["1720001784196746",4257]
["1720001565196875",4258]
["1720001643196722",4259]
["1720001462196798",4260]
["1720001948196892",4261]
["1720001552196890",4262]
["1720001854196716",4263]
["1720001547196780",4264]
["1720001875196695",4265]
["1720001548196849",4266]
["1720001869196819",4267]
["1720001810196751",4268]
["1720001752196956",4270]
["172000163214829",4271]
["1720001768196920",4272]
["1720001718196935",4273]
["1720001525196820",4274]
["1720001748196929",4275]
["1720001738123689",4276]
["1720001842123957",4277]
["1720001759176723",4278]
["1720001987125411",4279]
["1720001769105159",4280]
["1720001789196881",4282]
["1720001676196884",4283]
["1720001988196764",4284]
["1720001945120438",4286]
["1720001783163537",4287]
["1720001989196772",4288]
["1720001704196728",4289]
["1720001694196887",4291]
["172000188753588",4294]
["17200018413324",4295]
["1720001782196847",4296]
["1720001731196747",4297]
["1720001771196808",4299]
["1720001771196809",4300]
["1720001772196807",4301]
["172000173071075",4302]
["1720001761196878",4303]
["172000182715931",4304]
["1720001809196886",4305]
["1720001888196738",4306]
["172000188120322",4307]
["172000188428413",4308]
["1720001790148022",4312]
["1720001807196760",4313]
["1720001955196779",4314]
["1720001808196852",4315]
["1720001890196815",4316]
["1720001909196951",4317]
["1720001796196829",4318]
["1720001959196945",4319]
["1720001961196946",4320]
["1720001892170942",4322]
["172000191934756",4323]
["1720002021152517",4324]
["1720001851196545",4325]