{"text_format":"1","workbook":"xlsx","n_sheets":9,"sheets":["User Tips","Property Info","EWEMs","Units and Spaces","Observations","Photos","Units - Print Sheet","CommonArea - Print Sheet","Data"],"not_rendered":{"charts":0,"images":1,"macros":1,"external_links":0,"defined_names":14,"comments":4,"pivot_tables":0},"unopened":[],"bounds":{"document_bytes":16777216,"sheet_cells":100000,"rows_first":2000,"rows_last":500,"rows_between":2000,"halvings":0,"cell_chars":16384,"cell_head_chars":4096},"cells_cut":0,"cells_raw":0,"read":"whole","date_system":"1900"}

{"sheet":"User Tips","index":0,"n_rows":31,"n_cols":3,"rows_kept":31,"cut":false,"hidden":false,"merged":[]}
["Red Cells are warnings",null,"This is Form 4221 Version 1.3"]
["Orange cell is a Partial Measure warning",null,"Updated April 14, 2021"]
["Yellow Cells are required fields that are blank"]
["Gray Cells are calculated or pulled from database"]
["Green Cells are auto calculations"]
["Black Cells are not required"]
["Purple Cells are optional"]
[]
[]
["Warning Flags:","Tab:"]
{"$rows_left_out":22}
{"sheet":"Property Info","index":1,"n_rows":28,"n_cols":8,"rows_kept":28,"cut":false,"hidden":false,"merged":[[2,1,2,3],[27,2,27,5],[19,2,19,3],[21,2,21,3],[22,2,22,3],[20,2,20,3],[23,2,23,3],[24,2,24,3],[25,2,25,3]]}
[null,null,"Fannie Mae Multifamily Green Inspection Form"]
[null,"INPUT: Property and Inspection Information"]
[null,"Instructions:  Enter the Fannie Mae Loan ID and Property Linkage ID. The Servicer must confirm that the EWEMs listed in this Inspection Form match what is shown in the Schedule 6 and/or any Schedule 6 amendments. The inspector may then enter the inspection information."]
[null,"When completed and reviewed, submit this form to green_inspections@fanniemae.com."]
[null,"PROJECT INFORMATION"]
[]
[null,"Enter the Fannie Mae Loan ID here ↓",null,"Property Name","Pine Barren Estates"]
[null,1717479422,null,"Street Address","349 Marlboro Drive"]
[null,null,null,"City","Stockton"]
[null,"Enter the Property Linkage ID here ↓",null,"State","CA"]
{"$rows_left_out":19}
{"sheet":"EWEMs","index":2,"n_rows":24,"n_cols":24,"rows_kept":24,"cut":false,"hidden":false,"merged":[[1,8,1,10]]}
[null,null,"INPUT: EWEM Inspection Information",null,null,null,null,null,null,null,null,null,null,null,null,null,null,null,null,null,"basic/complex","maybe partial","EWEM list name","Weird namplate error"]
[null,null,"Instructions:  Fill out the nameplate specification if it is an aerator, showerhead, or toilet. Add any EWEM-level comments.",null,{"$f":"IF(SUM(X5:X24)>0,\"↓Unusual Nameplate Spec - Please Review\",\"\")","v":""},null,null,null,{"$f":"\"Total Units in Bldg: \"&'Property Info'!E16","v":"Total Units in Bldg: 140"}]
[]
["Number","EWEM Number","EWEM Name","EWEM Description","Nameplate Specification","EWEM Estimated Cost","EWEM ACTUAL Cost","EWEM ACTUAL Date Completed","Space Category","Estimated Quantity Installed","Number of units in which to install","Inspection Result Description","Total Tests","Noncompliant Tests","Noncompliance %","EWEM Compliant Per S6? *Preliminary"]
[1,2,"Upgrade common area lighting","Lighting - Interior - High Efficacy (LED), Common Area",null,580,null,null,"Common Areas",0,0,null,{"$f":"IF(C5<>\"\",COUNTIF(Observations!$D$7:$D$506,EWEMs!W5),\"\")","v":0},{"$f":"IF(C5<>\"\",COUNTIF(Observations!L$7:L$506,EWEMs!W5&\"noncompliant\"),\"\")","v":0},{"$f":"IF(C5<>\"\",N5/M5,\"\")","v":{"$error":"#DIV/0!"}},{"$f":"IF(C5<>\"\",IF(OR(C5=\"Install low-flow kitchen faucets\", C5=\"Install low-flow bath faucets\", C5=\"Install low-flow showerheads\", C5=\"Install low-flow fixtures\"), IF(O5<=0.5,\"Yes\",\"No\"),\nIF(C5=\"Upgrade in-unit lighting\",IF(O5<0.255,\"Yes\",\"No\"),\nIF(OR(C5=\"Install low-flush toilets\", C5=\"Upgrade exterior lighting\", C5=\"Upgrade common area lighting\", C5=\"Upgrade whole building lighting\",C5=\"Replace wall/window AC\", C5=\"Add window films\", C5=\"Install or replace solar screens\"), IF(O5<0.105,\"Yes\", \"No\"),\nIF(O5=0,\"Yes\",\"No\")))),\"\")","v":{"$error":"#DIV/0!"}},null,null,null,null,{"$f":"VLOOKUP(C5,Data!A:I,9,FALSE)","v":"BASIC"},{"$f":"IF(AND(OR(I5=\"Apartments and Common Areas\", I5=\"Apartments\"),K5<0.95*'Property Info'!$E$16),\"maybe partial\",\"\")","v":""},{"$f":"IF(C5=\"\",\"\",B5&\" - \"&C5&\" - \"&I5)","v":"2 - Upgrade common area lighting - Common Areas"},{"$f":"IF(NOT(OR(E5=\"\",E5=0.5,E5=0.8, E5=1,E5=1.1, E5=1.25, E5=1.5, E5=1.75, E5=2)),1,0)","v":0}]
[2,3,"Upgrade in-unit lighting","Lighting - Interior - High Efficacy (LED), All  Res. Units",null,23000,null,null,"Apartments",0,140,null,{"$f":"IF(C6<>\"\",COUNTIF(Observations!$D$7:$D$506,EWEMs!W6),\"\")","v":0},{"$f":"IF(C6<>\"\",COUNTIF(Observations!L$7:L$506,EWEMs!W6&\"noncompliant\"),\"\")","v":0},{"$error":"#DIV/0!"},{"$error":"#DIV/0!"},null,null,null,null,{"$f":"VLOOKUP(C6,Data!A:I,9,FALSE)","v":"BASIC"},{"$f":"IF(AND(OR(I6=\"Apartments and Common Areas\", I6=\"Apartments\"),K6<0.95*'Property Info'!$E$16),\"maybe partial\",\"\")","v":""},{"$f":"IF(C6=\"\",\"\",B6&\" - \"&C6&\" - \"&I6)","v":"3 - Upgrade in-unit lighting - Apartments"},{"$f":"IF(NOT(OR(E6=\"\",E6=0.5,E6=0.8, E6=1,E6=1.1, E6=1.25, E6=1.5, E6=1.75, E6=2)),1,0)","v":0}]
[3,4,"Upgrade exterior lighting","Lighting -  Exterior -  High Efficacy (LED), Common Area",null,670,null,null,"Common Areas",0,0,null,{"$f":"IF(C7<>\"\",COUNTIF(Observations!$D$7:$D$506,EWEMs!W7),\"\")","v":0},{"$f":"IF(C7<>\"\",COUNTIF(Observations!L$7:L$506,EWEMs!W7&\"noncompliant\"),\"\")","v":0},{"$error":"#DIV/0!"},{"$error":"#DIV/0!"},null,null,null,null,{"$f":"VLOOKUP(C7,Data!A:I,9,FALSE)","v":"BASIC"},{"$f":"IF(AND(OR(I7=\"Apartments and Common Areas\", I7=\"Apartments\"),K7<0.95*'Property Info'!$E$16),\"maybe partial\",\"\")","v":""},"4 - Upgrade exterior lighting - Common Areas",0]
[4,9,"Upgrade exterior lighting","Lighting - Exterior - High Efficacy (LED), All  Res.  Units",null,2400,null,null,"Apartments",0,140,null,{"$f":"IF(C8<>\"\",COUNTIF(Observations!$D$7:$D$506,EWEMs!W8),\"\")","v":0},{"$f":"IF(C8<>\"\",COUNTIF(Observations!L$7:L$506,EWEMs!W8&\"noncompliant\"),\"\")","v":0},{"$error":"#DIV/0!"},{"$error":"#DIV/0!"},null,null,null,null,{"$f":"VLOOKUP(C8,Data!A:I,9,FALSE)","v":"BASIC"},{"$f":"IF(AND(OR(I8=\"Apartments and Common Areas\", I8=\"Apartments\"),K8<0.95*'Property Info'!$E$16),\"maybe partial\",\"\")","v":""},"9 - Upgrade exterior lighting - Apartments",0]
[5,10,"Install low-flow kitchen faucets","Water Fixture  - Kitchen Aerators  (1.0 gpm), All  Res. Units",null,1400,null,null,"Apartments",0,140,null,{"$f":"IF(C9<>\"\",COUNTIF(Observations!$D$7:$D$506,EWEMs!W9),\"\")","v":0},{"$f":"IF(C9<>\"\",COUNTIF(Observations!L$7:L$506,EWEMs!W9&\"noncompliant\"),\"\")","v":0},{"$error":"#DIV/0!"},{"$error":"#DIV/0!"},null,null,null,null,{"$f":"VLOOKUP(C9,Data!A:I,9,FALSE)","v":"BASIC"},{"$f":"IF(AND(OR(I9=\"Apartments and Common Areas\", I9=\"Apartments\"),K9<0.95*'Property Info'!$E$16),\"maybe partial\",\"\")","v":""},"10 - Install low-flow kitchen faucets - Apartments",0]
[6,11,"Install low-flow bath faucets","Water Fixture  - Bathroom Aerators  (0.5 gpm), All  Res. Units",null,3168,null,null,"Apartments",0,140,null,{"$f":"IF(C10<>\"\",COUNTIF(Observations!$D$7:$D$506,EWEMs!W10),\"\")","v":0},{"$f":"IF(C10<>\"\",COUNTIF(Observations!L$7:L$506,EWEMs!W10&\"noncompliant\"),\"\")","v":0},{"$error":"#DIV/0!"},{"$error":"#DIV/0!"},null,null,null,null,{"$f":"VLOOKUP(C10,Data!A:I,9,FALSE)","v":"BASIC"},{"$f":"IF(AND(OR(I10=\"Apartments and Common Areas\", I10=\"Apartments\"),K10<0.95*'Property Info'!$E$16),\"maybe partial\",\"\")","v":""},"11 - Install low-flow bath faucets - Apartments",0]
{"$rows_left_out":15}
{"sheet":"Units and Spaces","index":3,"n_rows":143,"n_cols":7,"rows_kept":143,"cut":false,"hidden":false,"merged":[]}
[null,"INPUT: Units and Spaces Inspected"]
[null,"Instructions:  List all unique spaces inspected, including all apartment units and common areas. Correct any duplicate space names before recording inspection observations. Do not leave any spaces in the list."]
[]
[null,"Minimum number of units to inspect:",{"$f":"ROUND(IF('Property Info'!E16<20,3,IF('Property Info'!E16>600,30,IF('Property Info'!E16<56,5,IF('Property Info'!E16<100,'Property Info'!E16*0.1,IF('Property Info'!E16<201,10,'Property Info'!E16*0.05))))),0)","v":10}]
[null,"Number of units recorded:",{"$f":"ROUND(SUMPRODUCT(1/COUNTIF(F7:F143,F7:F143&\"\"))-1,0)","v":6},null,null,"apartments","all spaces"]
[null,"Unit # or Space name","Space Type","Notes (optional)"]
[null,"1","Apartment",null,{"$f":"IF(AND(B7=\"\",B8<>\"\"),\"No blanks, please! They create errors\",\"\")","v":""},{"$f":"IF(C7=\"Apartment\",IF(B7=0,\"\",B7),\"\")","v":"1"},{"$f":"IF(B7<>\"\",B7,\"\")","v":"1"}]
[null,"2","Apartment",null,{"$f":"IF(AND(B8=\"\",B9<>\"\"),\"No blanks, please! They create errors\",\"\")","v":""},{"$f":"IF(C8=\"Apartment\",IF(B8=0,\"\",B8),\"\")","v":"2"},{"$f":"IF(B8<>\"\",B8,\"\")","v":"2"}]
[null,"3","Apartment",null,"","3","3"]
[null,"4","Apartment",null,"","4","4"]
{"$rows_left_out":134}
{"sheet":"Observations","index":4,"n_rows":506,"n_cols":14,"rows_kept":506,"cut":false,"hidden":false,"merged":[]}
[null,"INPUT: EWEM Observations"]
[null,"Instructions:  Add tests for each EWEM for each space. Water EWEMs require the Nameplate number. You must inspect at least as many units as indicated below in D4. "]
[]
[null,"Minimum number of units to inspect:",null,{"$f":"ROUND(IF('Property Info'!E16<20,3,IF('Property Info'!E16>600,30,IF('Property Info'!E16<56,5,IF('Property Info'!E16<100,'Property Info'!E16*0.1,IF('Property Info'!E16<201,10,'Property Info'!E16*0.05))))),0)","v":10},null,null,null,null,null,null,null,"Helper for compliance counts","Helper for unit counts","This is a water fixture"]
[null,"Number of units inspected so far:",null,{"$f":"ROUND(SUMPRODUCT(1/COUNTIF(M7:M506,M7:M506&\"\"))-1,0)","v":0}]
[null,"Unit # or Space name","Space Type","EWEM","Nameplate Number Value","Fixture Compliance","Compliant or Noncompliant?","Supporting comments for this observation"]
[null,null,{"$f":"IF(B7=\"\",\"\",INDEX('Units and Spaces'!C:C,MATCH(Observations!B7,'Units and Spaces'!B:B,0)))","v":""},null,null,{"$f":"IF(AND(N7=TRUE,E7<>\"\"), IF(E7=0.5, IF(INDEX(EWEMs!$E$5:$E$24,MATCH(D7,EWEMs!$W$5:$W$24,0))=0.5,\"compliant\", \"noncompliant\"), IF(OR(INDEX(EWEMs!$E$5:$E$24,MATCH(D7,EWEMs!$W$5:$W$24,0))*1.11>E7, E7=1),\"compliant\",\"noncompliant\")),\"\")","v":""},null,null,null,null,null,{"$f":"IF(OR(F7=\"compliant\",F7=\"noncompliant\"),D7&F7,D7&G7)","v":""},{"$f":"IF(C7=\"Apartment\",IF(B7=0,\"\",B7),\"\")","v":""},{"$f":"IF(OR(ISNUMBER(FIND(\"low-flow\",D7,1)), ISNUMBER(FIND(\"low-flush\",D7,1))),TRUE,FALSE)","v":false}]
[null,null,{"$f":"IF(B8=\"\",\"\",INDEX('Units and Spaces'!C:C,MATCH(Observations!B8,'Units and Spaces'!B:B,0)))","v":""},null,null,{"$f":"IF(AND(N8=TRUE,E8<>\"\"), IF(E8=0.5, IF(INDEX(EWEMs!$E$5:$E$24,MATCH(D8,EWEMs!$W$5:$W$24,0))=0.5,\"compliant\", \"noncompliant\"), IF(OR(INDEX(EWEMs!$E$5:$E$24,MATCH(D8,EWEMs!$W$5:$W$24,0))*1.11>E8, E8=1),\"compliant\",\"noncompliant\")),\"\")","v":""},null,null,null,null,null,{"$f":"IF(OR(F8=\"compliant\",F8=\"noncompliant\"),D8&F8,D8&G8)","v":""},{"$f":"IF(C8=\"Apartment\",IF(B8=0,\"\",B8),\"\")","v":""},{"$f":"IF(OR(ISNUMBER(FIND(\"low-flow\",D8,1)), ISNUMBER(FIND(\"low-flush\",D8,1))),TRUE,FALSE)","v":false}]
[null,null,{"$f":"IF(B9=\"\",\"\",INDEX('Units and Spaces'!C:C,MATCH(Observations!B9,'Units and Spaces'!B:B,0)))","v":""},null,null,{"$f":"IF(AND(N9=TRUE,E9<>\"\"), IF(E9=0.5, IF(INDEX(EWEMs!$E$5:$E$24,MATCH(D9,EWEMs!$W$5:$W$24,0))=0.5,\"compliant\", \"noncompliant\"), IF(OR(INDEX(EWEMs!$E$5:$E$24,MATCH(D9,EWEMs!$W$5:$W$24,0))*1.11>E9, E9=1),\"compliant\",\"noncompliant\")),\"\")","v":""},null,null,null,null,null,"","",false]
[null,null,{"$f":"IF(B10=\"\",\"\",INDEX('Units and Spaces'!C:C,MATCH(Observations!B10,'Units and Spaces'!B:B,0)))","v":""},null,null,{"$f":"IF(AND(N10=TRUE,E10<>\"\"), IF(E10=0.5, IF(INDEX(EWEMs!$E$5:$E$24,MATCH(D10,EWEMs!$W$5:$W$24,0))=0.5,\"compliant\", \"noncompliant\"), IF(OR(INDEX(EWEMs!$E$5:$E$24,MATCH(D10,EWEMs!$W$5:$W$24,0))*1.11>E10, E10=1),\"compliant\",\"noncompliant\")),\"\")","v":""},null,null,null,null,null,"","",false]
{"$rows_left_out":497}
{"sheet":"Photos","index":5,"n_rows":1,"n_cols":2,"rows_kept":1,"cut":false,"hidden":false,"merged":[]}
["Write the photo location and description here ↓","Insert the photo here, next to the description ↓"]

{"sheet":"Units - Print Sheet","index":6,"n_rows":38,"n_cols":12,"rows_kept":38,"cut":false,"hidden":false,"merged":[[0,11,0,12],[3,8,3,11],[2,8,2,11],[23,7,24,7],[26,7,27,7],[3,6,3,7],[25,1,25,6],[27,1,27,6],[6,1,6,6],[5,1,5,6],[5,7,6,7],[35,7,36,7],[8,7,9,7],[11,7,12,7],[14,7,15,7],[17,7,18,7],[20,7,21,7],[28,1,28,6],[29,7,30,7],[32,7,33,7],[31,1,31,6],[33,1,33,6],[34,1,34,6],[36,1,36,6],[37,1,37,6],[30,1,30,6],[7,1,7,6],[9,1,9,6],[10,1,10,6],[12,1,12,6],[13,1,13,6],[15,1,15,6],[16,1,16,6],[18,1,18,6],[19,1,19,6],[21,1,21,6],[22,1,22,6],[24,1,24,6]]}
[" Green Rewards Verification Inspection",null,null,null,null,null,null,{"$f":"IF(ISBLANK('Property Info'!C20), \"[Enter Inspector's name in Property Info tab]\", 'Property Info'!C20)","v":"[Enter Inspector's name in Property Info tab]"},null,null,{"$f":"IF(ISBLANK('Property Info'!C21), \"[Enter Inspection Company in Property Info tab]\", 'Property Info'!C21)","v":"[Enter Inspection Company in Property Info tab]"},{"$f":"IF(ISBLANK('Property Info'!C22), \"[Enter date of inspection in Property Info tab]\", 'Property Info'!C22)","v":"[Enter date of inspection in Property Info tab]"}]
[null,{"$f":"'Property Info'!E7","v":"Pine Barren Estates"}]
[null,{"$f":"'Property Info'!E8&\", \"&'Property Info'!E9&\", \"&'Property Info'!E11","v":"349 Marlboro Drive, Stockton, 92587"},null,null,null,null,null,null,"Inspection number ___________"]
[null,null,null,null,null,null,"Unit Number",null,{"$f":"\"out of \"&'Property Info'!G23&\" total required units to inspect.\"","v":"out of 10 total required units to inspect."}]
[null,"In Unit EWEMs required for inspection:"]
[1,{"$f":"IFERROR(INDEX(selectedEWEMs,SMALL(IF(IF(ISNUMBER(SEARCH(\"Apartments\",ApartmentList)),TRUE,FALSE),ROW(ApartmentList)-MIN(ROW(ApartmentList))+1),EWEMs!A5)),\"\")","v":"Upgrade in-unit lighting"},null,null,null,null,null,"Compliant? Y/N","Visual description & notes"]
[null,{"$f":"IFERROR(INDEX(EWEMs!D5:D24,SMALL(IF(IF(ISNUMBER(SEARCH(\"Apartments\",ApartmentList)),TRUE,FALSE),ROW(ApartmentList)-MIN(ROW(ApartmentList))+1),EWEMs!A5)),\"\")","v":"Lighting - Interior - High Efficacy (LED), All  Res. Units"}]
[null,{"$f":"IFERROR(\"BEFORE: \"&VLOOKUP(B6,Data!A:C,3,FALSE)&\" DURING: \"&VLOOKUP(B6,Data!A:D,4,FALSE),\"\")","v":"BEFORE: Request the installed product specifications and determine sample size required for verification of each fixture type to be inspected during site visit; refer to Inspection Form or invoices for full fixture quantities by type and location. Take note of where in the unit these are installed (e.g. highlight on printout of unit layout) for easier access during the site visit. DURING: Verify lighting fixtures according to determined sample size, confirming they are installed, operational and match the product specifications. "},null,null,null,null,null,"Nameplate GPM/GPF (if applicable)"]
[2,{"$f":"IFERROR(INDEX(selectedEWEMs,SMALL(IF(IF(ISNUMBER(SEARCH(\"Apartments\",ApartmentList)),TRUE,FALSE),ROW(ApartmentList)-MIN(ROW(ApartmentList))+1),EWEMs!A6)),\"\")","v":"Upgrade exterior lighting"},null,null,null,null,null,"Compliant? Y/N","Visual description & notes"]
[null,{"$f":"IFERROR(INDEX(EWEMs!$D$5:$D$24,SMALL(IF(IF(ISNUMBER(SEARCH(\"Apartments\",ApartmentList)),TRUE,FALSE),ROW(ApartmentList)-MIN(ROW(ApartmentList))+1),EWEMs!A6)),\"\")","v":"Lighting - Exterior - High Efficacy (LED), All  Res.  Units"}]
{"$rows_left_out":29}
{"sheet":"CommonArea - Print Sheet","index":7,"n_rows":29,"n_cols":12,"rows_kept":29,"cut":false,"hidden":false,"merged":[[28,1,28,6],[22,1,22,6],[23,7,24,7],[24,1,24,6],[25,1,25,6],[26,7,27,7],[27,1,27,6],[17,7,18,7],[18,1,18,6],[19,1,19,6],[20,7,21,7],[21,1,21,6],[13,1,13,6],[14,7,15,7],[15,1,15,6],[16,1,16,6],[7,1,7,6],[8,7,9,7],[9,1,9,6],[10,1,10,6],[11,7,12,7],[12,1,12,6],[0,11,0,12],[2,8,2,11],[3,6,3,7],[3,8,3,11],[5,7,6,7],[6,1,6,6]]}
[" Green Rewards Verification Inspection",null,null,null,null,null,null,{"$f":"IF(ISBLANK('Property Info'!C20), \"[Enter Inspector's name in Property Info tab]\", 'Property Info'!C20)","v":"[Enter Inspector's name in Property Info tab]"},null,null,{"$f":"IF(ISBLANK('Property Info'!C21), \"[Enter Inspection Company in Property Info tab]\", 'Property Info'!C21)","v":"[Enter Inspection Company in Property Info tab]"},{"$f":"IF(ISBLANK('Property Info'!C22), \"[Enter date of inspection in Property Info tab]\", 'Property Info'!C22)","v":"[Enter date of inspection in Property Info tab]"}]
[null,"Pine Barren Estates"]
[null,"349 Marlboro Drive, Stockton, 92587"]
[null,null,null,null,null,null,"Common Area Name(s)"]
[null,"Common Area EWEMs required for inspection:"]
[1,{"$f":"IFERROR(\nINDEX(selectedEWEMs,SMALL(\nIF(IF(ISNUMBER(SEARCH(\"Common\",ApartmentList)),TRUE,FALSE),ROW(ApartmentList)-MIN(ROW(ApartmentList))+1),EWEMs!A5)\n),\"\")","v":"Upgrade common area lighting"},null,null,null,null,null,"Compliant? Y/N","Visual description, locations & notes"]
[null,"Lighting - Interior - High Efficacy (LED), Common Area"]
[null,"Request the installed product specifications and determine sample size required for verification of each fixture type to be inspected during site visit; refer to Inspection Form or invoices for full fixture quantities by type and location. Take note of where on the property these are installed (e.g. highlight on printout of property map) for easier access during the site visit.",null,null,null,null,null,"Nameplate GPM/GPF (if applicable)"]
[2,"Upgrade exterior lighting",null,null,null,null,null,"Compliant? Y/N","Visual description, locations & notes"]
[null,"Lighting -  Exterior -  High Efficacy (LED), Common Area"]
{"$rows_left_out":20}
{"sheet":"Data","index":8,"n_rows":94,"n_cols":9,"rows_kept":94,"cut":false,"hidden":true,"merged":[]}
[]
[]
[]
[]
[]
["EWEM",null,"Before Inspection","During Inspection"]
["Add or upgrade BAS/EMS/EMCS","complex","Request the installed product specifications and user manual if applicable; refer to Inspection Form or invoices. Take note of where the system is installed (i.e. highlight on printout of property map) for easier access during the site visit.","Take photos of controls including nameplate, verifying that this matches with specification. If needing to cycle through control settings, consult property staff and refer to user manual prior to doing so as this can impact default or custom conditions.","compliant",null,null,null,{"$f":"UPPER(B7)","v":"COMPLEX"}]
["Add or upgrade controls","complex","Request the installed product specifications and user manual if applicable; refer to Inspection Form or invoices. Take note of where the system is installed (i.e. highlight on printout of property map) for easier access during the site visit.","Take photos of controls including nameplate, verifying that this matches with specification. If needing to cycle through control settings, consult property staff and refer to user manual prior to doing so as this can impact default or custom conditions.","noncompliant",null,null,null,{"$f":"UPPER(B8)","v":"COMPLEX"}]
["Convert pneumatic controls to DDC","complex","Request the installed product specifications and user manual if applicable; refer to Inspection Form or invoices. Take note of where the system is installed (i.e. highlight on printout of property map) for easier access during the site visit.","Take photos of controls including nameplate, verifying that this matches with specification. If needing to cycle through control settings, consult property staff and refer to user manual prior to doing so as this can impact default or custom conditions.",null,null,null,null,"COMPLEX"]
["Install advanced metering systems","complex","Review the specification in the HPB and Inspection Form. Document any digital infrastructure with property staff with screenshots or login information; e.g. meter data management system.","Take photo confirming the correct equipment was installed based on product specifications; e.g. advanced/smart meters and/or load control devices in utility closets or exterior of building.",null,null,null,null,"COMPLEX"]
{"$rows_left_out":84}